program: Gaussian 09
title: 000239284
version: EM64L-G09RevD.01
frameworkgroup: C1[X(C3H7ClN2O2)]
method: RPBEPBE
basis: SDD
operation: Freq
keyword: #p
keyword: freq=noraman
keyword: PBEPBE/SDD
title: #p freq=noraman PBEPBE/SDD
converged: YES YES NO NO
title: Mulliken charges:
elementType: Cl O O N N C C C H H H H H H H
charge: -0.058616 -0.279337 -0.288954 -0.367482 -0.514521 -0.241981 -0.565185 0.301032 0.238105 0.251800 0.264147 0.300120 0.347054 0.306789 0.307027
chargesum: 0.00000
title: Mulliken charges with hydrogens summed into heavy atoms:
elementType: Cl O O N N C C C
charge: -0.058616 -0.279337 -0.288954 -0.020428 0.099294 0.247925 -0.000918 0.301032
polarizability: 7.60031255e+01 -1.79753289e-01 6.02402719e+01 -5.08350913e+00 -3.94391388e+00 4.82972396e+01
1716.lowfreq: -1.5076 -0.0014 0.0013 0.0023 6.6822 10.5140 40.5226 59.6616 115.1757
frequency: 40.4489 59.6316 115.1724 158.1995 193.4839 223.8857 249.2975 334.8834 415.2885 502.6950 595.6913 604.0487 652.6425 711.6936 714.4663 827.8156 925.8246 942.8216 1014.5514 1065.7919 1153.9949 1178.9295 1245.0105 1254.5784 1282.3011 1304.2349 1369.2027 1431.5626 1444.4635 1456.2333 1661.2327 1682.4910 3007.2901 3062.0558 3112.6220 3151.0192 3419.0329 3541.8304 3568.0764
redmass: 8.4381 5.9502 3.9510 4.0252 6.4427 1.0869 3.7775 3.0041 3.3612 3.4727 1.2211 4.1257 4.9796 4.2021 1.8268 2.6524 3.2404 2.4285 1.9746 3.1284 5.3816 1.3091 1.1689 2.5774 1.1604 1.1586 1.2419 1.0992 1.0974 1.6410 3.7856 1.2757 1.0638 1.0589 1.1006 1.1084 1.0422 1.1012 1.0790
irintensity: 0.9194 4.5977 3.4523 0.9995 1.5264 21.1920 14.8052 35.6649 8.6089 6.7525 184.6714 47.4111 32.2528 23.7306 124.1979 3.3887 3.8403 50.2102 68.6569 16.2762 262.9214 16.4704 3.3457 67.5750 0.1127 22.4160 5.1930 9.8824 26.1569 203.9419 279.7257 4.7487 21.7532 15.8024 5.4605 9.2234 0.3160 3.2643 49.0146
temp: 298.150 k
press: 1.00000 atm
elementType: 17 8 8 7 7 6 6 6 1 1 1 1 1 1 1
symmnumber: 1
zpe: 297119.5 jmol-1
zpe.correction: 0.113167 hartree
zpe.thermalcorrener: 0.122500 hartree
zpe.thermalcorrenthalpy: 0.123445 hartree
zpe.thermalcorrgfe: 0.077309 hartree
zpe.sumelectzpe: -837.858778 hartree
zpe.sumelectthermal: -837.849444 hartree
zpe.sumelectthermalent: -837.848500 hartree
zpe.sumelectthermalfe: -837.894635 hartree
dipole: 0.8512 1.3333 0.4543
dipole: 1.6458
quadrupole: -53.4791 -54.5230 -52.9521
quadrupole: -5.8364 -0.9932 2.5620
quadrupole: 0.1723 -0.8716 0.6993 -5.8364 -0.9932 2.5620
hfenergy: -837.9719445 hartree
pointgroup: C01 [X(C3H7Cl1N2O2)]
dipole: 0.3318094 0.5411891 0.1276173 debye
dipolederiv: -0.3204512 -0.1564437 -0.0189082 -0.2151569 -0.4253882 -0.0223825 0.018828 0.0421182 -0.1921408 -1.5356487 0.260234 0.2264453 0.3034714 -0.422948 0.0296825 0.4648535 -0.0639772 -0.5723822 -0.6643844 0.0318443 0.0881767 0.1018874 -0.6624993 0.2997897 0.0538144 0.3305349 -0.7602087 -0.6083112 0.1819121 -0.2138606 0.4116451 -0.6095744 -0.0840145 -0.4227524 0.0292414 -0.2553753 -0.1644488 0.1463746 -0.0883333 0.2312229 -0.2994621 0.1779514 -0.1737097 0.2148279 -0.1705894 0.7600338 -0.181248 0.0239632 -0.4564474 0.2431746 0.0422215 0.1772786 0.0134697 0.2169076 0.2659194 0.2541751 -0.03866 0.356798 0.5397125 -0.0938927 -0.1058822 -0.044447 0.0760227 1.8067604 -0.4704315 -0.2087935 -0.5520572 0.9898787 -0.4654166 -0.3484384 -0.4476953 1.0040007 -0.0096724 -0.1050005 -0.01671 0.0238149 -0.0689332 0.0139085 -0.0980743 0.0381555 0.0916503 -0.0167643 0.0502278 0.0606242 0.0499246 0.1110602 0.0132211 0.0538102 -0.0397766 -0.0413499 -0.0659738 0.046754 -0.0249297 0.0263041 -0.0764243 0.0556495 -0.0424738 0.0343894 0.1071713 0.0608 -0.0406183 0.1004135 -0.060789 -0.0028131 -0.0080806 0.0714261 -0.0182846 0.0056003 0.1526206 0.0589358 0.0901593 0.0323783 0.286451 0.0681824 0.1244649 0.0509098 0.2390903 0.2064278 -0.0264518 0.0643056 -0.1450691 0.0845019 -0.0380188 0.1690635 -0.0452387 0.2084118 0.1330928 -0.0502637 -0.0438925 -0.1079271 0.3132637 0.011199 0.0577915 -0.0942272 0.0431912 unknown
polarizability: 76.1036817|-0.5901194|59.312195|-4.757528|-5.0957295|49.1247602 unknown
InChI: InChI=1S/C3H7ClN2O2/c4-1-2-8-3(7)6-5/h6H,1-2,5H2
charge 0 multiplicity 1
15 atoms
Cl -3.130509 -1.199491 -0.276603
O  -0.264745 -0.033843 0.783025
O  0.952171 0.8043 -1.066807
N  1.788666 -0.892571 0.336169
N  3.021386 -1.077169 -0.324571
C  -1.369055 0.887949 0.448798
C  -2.22579 0.397955 -0.711667
C  0.846886 0.027084 -0.083295
H  -0.948483 1.876058 0.177307
H  -1.950574 0.963819 1.380048
H  -3.014724 1.131228 -0.941634
H  -1.626771 0.181222 -1.606669
H  1.5965 -1.482166 1.146248
H  3.605441 -0.232728 -0.287616
H  2.894302 -1.416045 -1.286332
