program: Gaussian 09
title: 000239254
version: EM64L-G09RevD.01
frameworkgroup: C1[X(C13H17NO2)]
method: RPBEPBE
basis: SDD
operation: Freq
keyword: #p
keyword: freq=noraman
keyword: PBEPBE/SDD
title: #p freq=noraman PBEPBE/SDD
converged: YES YES NO NO
title: Mulliken charges:
elementType: O O N C C C C C C C C C C C C C H H H H H H H H H H H H H H H H H
charge: -0.326562 -0.281827 -0.249684 0.052598 0.425200 -0.479018 0.268062 -0.683882 -0.684960 -0.340625 -0.372310 -0.013068 -0.222271 -0.227800 -0.253168 -0.580804 0.236781 0.258146 0.233869 0.212450 0.253809 0.215526 0.209941 0.229367 0.220823 0.282275 0.259600 0.244130 0.225371 0.224221 0.228090 0.221451 0.214270
chargesum: 0.00000
title: Mulliken charges with hydrogens summed into heavy atoms:
elementType: O O N C C C C C C C C C C C C C
charge: -0.326562 -0.281827 -0.249684 0.289379 0.425200 0.012997 0.268062 -0.002096 -0.024829 -0.058351 -0.112711 0.231062 0.003100 -0.003579 -0.025078 -0.145084
polarizability: 2.07790461e+02 2.25777973e+00 1.69931363e+02 -2.69784053e-01 -1.14864212e+00 8.99523559e+01
1716.lowfreq: -10.9840 -7.2309 -0.0003 0.0004 0.0006 5.7983 27.4663 36.7839 51.7780
frequency: 26.5511 36.7727 51.7221 68.0003 86.3090 96.8147 101.1496 129.1071 189.5701 194.0476 238.3702 244.5225 278.7923 296.2559 340.0439 363.8883 394.5216 404.5110 411.8919 416.9708 461.1755 517.0134 562.2831 611.2007 615.1366 682.3381 694.6471 702.6034 761.0643 766.1040 789.1357 834.9581 875.1651 905.5573 910.3814 923.7442 932.8421 941.8488 949.8061 967.3620 976.2375 985.3929 989.9494 1008.6808 1033.0420 1078.6451 1097.0486 1112.3851 1136.1043 1155.1861 1173.5454 1179.2362 1196.7982 1209.2971 1225.4140 1276.4487 1316.3998 1326.9261 1338.5292 1340.1467 1365.0625 1379.7920 1382.5412 1396.3327 1430.2756 1443.7110 1456.2081 1460.9026 1464.3684 1472.2818 1487.6995 1488.6218 1589.4865 1608.8241 1627.9663 1657.1961 2987.9139 2991.8666 3020.8926 3032.1953 3080.5606 3082.8004 3084.4740 3092.8013 3097.0894 3103.6477 3120.1872 3127.1982 3137.9412 3157.9718 3171.0876 3194.8872 3199.6527
redmass: 3.0195 3.6524 3.8630 3.9605 3.6883 3.8676 3.9453 3.2007 2.8280 1.0601 1.2506 3.0228 3.5366 3.8680 3.5485 3.1662 3.3098 2.7980 3.2085 3.5450 2.6040 3.0441 1.7557 4.8570 5.7247 4.1823 2.1865 4.9210 2.7276 2.4110 3.9515 1.2502 2.3992 1.5533 1.7006 1.2178 2.3097 1.3834 1.4268 1.4135 2.4678 2.4473 1.8787 1.2063 2.1898 2.6265 1.8910 2.1345 2.0786 2.0558 1.0665 2.0091 1.1658 2.8455 1.6840 1.2534 1.3930 1.3629 1.3112 1.2790 2.3324 1.2910 6.8942 1.2342 1.1958 2.3547 1.0529 1.0938 1.0490 1.0508 1.0810 2.1710 6.2702 6.3930 9.8566 4.6584 1.0356 1.0359 1.0596 1.0865 1.1026 1.0995 1.0615 1.0986 1.1004 1.1004 1.0946 1.0850 1.0904 1.0955 1.0973 1.1136 1.0945
irintensity: 0.1958 0.4042 2.5365 1.2244 0.3915 0.6498 0.0453 0.4841 4.0727 0.3573 0.1689 0.4397 5.6226 6.7899 4.0539 1.1293 5.0091 0.1373 5.9982 3.5233 1.2481 13.8414 4.2336 1.2448 2.8315 14.9245 24.5119 36.9635 25.0077 66.6577 0.3436 0.3085 2.8099 0.2984 14.4926 2.2500 30.4872 1.0730 43.5241 13.2921 180.2379 2.2046 5.1269 13.1699 4.0762 139.2008 260.0354 26.0761 75.3979 11.0794 5.1045 79.9544 0.3368 173.5644 65.2717 11.3498 27.1423 14.6911 16.5535 9.2172 235.6870 36.8890 5.5660 19.9151 12.8575 7.8225 6.4559 33.8027 3.3428 5.7121 22.0244 123.3888 4.4818 107.6819 240.1562 21.4088 16.8841 25.1493 18.8880 5.3552 6.1391 5.5269 11.7964 60.3338 23.8766 28.7752 6.6563 0.3356 19.5871 29.8468 11.2252 25.5639 1.7210
temp: 298.150 k
press: 1.00000 atm
elementType: 8 8 7 6 6 6 6 6 6 6 6 6 6 6 6 6 1 1 1 1 1 1 1 1 1 1 1 1 1 1 1 1 1
symmnumber: 1
zpe: 713716.2 jmol-1
zpe.correction: 0.271840 hartree
zpe.thermalcorrener: 0.288465 hartree
zpe.thermalcorrenthalpy: 0.289409 hartree
zpe.thermalcorrgfe: 0.226217 hartree
zpe.sumelectzpe: -709.569492 hartree
zpe.sumelectthermal: -709.552867 hartree
zpe.sumelectthermalent: -709.551923 hartree
zpe.sumelectthermalfe: -709.615116 hartree
dipole: -1.2125 1.8762 1.1460
dipole: 2.5107
quadrupole: -80.9843 -92.4197 -98.3113
quadrupole: 2.2487 1.0977 -2.7504
quadrupole: 9.5875 -1.8480 -7.7395 2.2487 1.0977 -2.7504
hfenergy: -709.841332 hartree
pointgroup: C01 [X(C13H17N1O2)]
dipole: -0.4915132 0.7271523 0.4531628 debye
polarizability: 207.4556636|3.5896942|170.0928415|-3.6547075|-2.5884156|90.1256753 unknown
InChI: InChI=1S/C13H17NO2/c1-4-10-14(13(15)16-11(2)3)12-8-6-5-7-9-12/h4-9,11H,1,10H2,2-3H3
charge 0 multiplicity 1
33 atoms
O  -2.221539 -0.049783 0.177801
O  -0.88327 -1.828428 -0.566013
N  0.066753 0.157884 0.324171
C  -3.441525 -0.881928 -0.121403
C  1.44752 -0.216574 0.124284
C  -0.239261 1.490941 0.927663
C  -0.98274 -0.679273 -0.060859
C  -3.712078 -1.821269 1.062535
C  -4.560166 0.129276 -0.382121
C  1.868944 -1.572274 0.189004
C  2.416028 0.799371 -0.097464
C  -0.523494 2.580828 -0.091407
C  3.234842 -1.891719 0.039756
C  3.780474 0.465472 -0.236935
C  4.20142 -0.881082 -0.168454
C  0.032094 3.816942 -0.063732
H  -3.211807 -1.473636 -1.02655
H  -1.129572 1.362809 1.567008
H  0.608077 1.772668 1.575727
H  -4.617069 -2.424765 0.864743
H  -2.865601 -2.512147 1.211829
H  -3.87615 -1.242674 1.989286
H  -5.496384 -0.403615 -0.628187
H  -4.303447 0.79109 -1.226941
H  -4.739906 0.753983 0.510762
H  1.133152 -2.364004 0.335558
H  2.104694 1.843102 -0.194591
H  -1.264154 2.320384 -0.85955
H  3.543061 -2.942036 0.092731
H  4.511201 1.263212 -0.412042
H  5.259985 -1.13898 -0.280479
H  -0.238894 4.58428 -0.797079
H  0.767512 4.104143 0.699749
