program: Gaussian 09
title: 000239236
version: EM64L-G09RevD.01
frameworkgroup: C1[X(C8H13N3O2)]
method: RPBEPBE
basis: SDD
operation: Freq
keyword: #p
keyword: freq=noraman
keyword: PBEPBE/SDD
title: #p freq=noraman PBEPBE/SDD
converged: YES YES NO NO
title: Mulliken charges:
elementType: O O N N N C C C C C C C C H H H H H H H H H H H H H
charge: -0.234803 -0.204851 -0.389983 -0.041389 -0.598145 0.074644 -0.392511 -0.392069 0.161899 0.132381 -0.701202 -0.701807 0.008978 0.251641 0.182653 0.183685 0.251645 0.239320 0.231928 0.222949 0.232749 0.239020 0.223123 0.351787 0.322356 0.346002
chargesum: 0.00000
title: Mulliken charges with hydrogens summed into heavy atoms:
elementType: O O N N N C C C C C C C C
charge: -0.234803 -0.204851 -0.038196 -0.041389 0.070213 0.074644 0.041783 0.043261 0.161899 0.132381 -0.007004 -0.006916 0.008978
polarizability: 1.36441465e+02 -7.94877951e-01 8.97119461e+01 -3.72625759e+00 1.76294375e+00 1.10639559e+02
1716.lowfreq: -14.7237 -11.9889 -0.0005 0.0004 0.0008 10.7612 20.6335 89.7665 99.2006
frequency: 20.3061 89.7286 99.1542 134.4842 148.5846 172.3031 185.6047 198.0193 215.4662 285.3441 323.9118 329.7501 365.4839 374.8630 417.8709 438.0046 477.5002 485.1340 577.8991 603.7168 619.0154 677.4774 704.3238 712.0346 726.7758 759.8098 778.0797 788.1133 899.4935 918.3605 936.9986 945.8381 1040.4741 1066.9074 1076.1151 1085.8479 1086.9558 1148.8806 1171.5704 1237.6225 1253.7327 1273.9712 1298.7439 1318.8860 1340.0916 1353.8765 1400.2086 1400.7974 1405.3314 1457.4623 1470.2115 1479.4285 1481.0853 1481.4121 1483.3581 1553.6189 1606.9745 1635.6550 1646.5258 2978.8532 2985.0229 2985.4615 2986.1060 3046.0201 3050.9414 3082.8555 3083.7488 3084.4089 3085.1983 3505.4952 3524.9668 3683.2068
redmass: 5.3515 2.6452 2.4305 8.4781 3.1580 3.9995 7.9899 1.2733 1.1489 1.6142 2.2598 3.4691 5.2452 5.2125 2.8343 5.6947 1.1534 9.1377 5.2472 1.3681 3.9267 2.2095 5.0948 3.5795 5.9575 1.4079 1.3092 1.5669 3.0079 1.8691 1.6987 3.8126 1.5654 3.6150 1.3993 3.7576 2.4837 2.9271 2.2898 4.4058 1.1626 1.7089 1.3747 1.9406 2.0765 1.7078 1.3030 1.2530 2.3743 1.0790 1.1355 1.0483 1.0516 1.0544 1.0445 4.1096 1.7840 5.5327 4.5782 1.0631 1.0576 1.0375 1.0409 1.0981 1.0981 1.1003 1.0993 1.1001 1.1005 1.0766 1.0460 1.1034
irintensity: 0.9935 0.5094 0.0665 10.4996 0.8777 0.3642 3.9868 0.5015 0.1139 0.0090 2.6451 1.1247 7.2505 8.7394 0.0302 8.3808 138.1130 6.0816 1.2113 72.2326 15.4031 55.8127 3.3941 13.1176 1.3525 2.3009 48.9630 73.3782 9.6775 5.0353 9.5616 0.3891 15.6347 0.7469 1.4621 0.3556 71.6028 18.6900 5.8865 254.0334 2.3708 54.5829 2.2960 7.3912 8.7957 4.6944 12.8344 17.7139 43.3385 1.7218 25.6704 5.5132 12.5849 7.4507 14.7526 230.7260 457.4660 554.9448 65.1524 6.7502 65.3001 31.6328 4.2190 0.0144 3.0150 10.2375 47.9348 13.7500 55.7734 45.1513 74.4589 37.8160
temp: 298.150 k
press: 1.00000 atm
elementType: 8 8 7 7 7 6 6 6 6 6 6 6 6 1 1 1 1 1 1 1 1 1 1 1 1 1
symmnumber: 1
zpe: 554753.1 jmol-1
zpe.correction: 0.211294 hartree
zpe.thermalcorrener: 0.224764 hartree
zpe.thermalcorrenthalpy: 0.225708 hartree
zpe.thermalcorrgfe: 0.171305 hartree
zpe.sumelectzpe: -626.392294 hartree
zpe.sumelectthermal: -626.378825 hartree
zpe.sumelectthermalent: -626.377880 hartree
zpe.sumelectthermalfe: -626.432284 hartree
dipole: -6.0322 0.3185 2.7848
dipole: 6.6516
quadrupole: -89.8519 -74.7624 -77.2479
quadrupole: -0.8149 -12.8733 -0.0709
quadrupole: -9.2311 5.8583 3.3728 -0.8149 -12.8733 -0.0709
hfenergy: -626.6035886 hartree
pointgroup: C01 [X(C8H13N3O2)]
dipole: -2.2839151 1.2752985 -0.0761742 debye
dipolederiv: -0.6667502 -0.1945999 0.0216109 -0.323382 -0.9459302 0.0548347 0.0321011 0.0509414 -0.3813482 -1.3005732 0.0603541 0.0098414 0.1309546 -0.5816125 0.0154467 0.0041443 0.0163922 -0.3687557 -1.1248108 -0.6326285 0.0650479 -0.2550563 -0.7973058 0.0449165 0.0331987 0.0516533 -0.2980737 -1.290899 0.7289741 -0.0431984 0.3313603 -0.9089565 0.0477583 -0.0105173 0.0410256 -0.2551752 -0.5308729 0.361422 -0.0299005 0.6069886 -1.0282986 0.0207838 -0.0490451 0.0248454 -0.6449357 -0.2719402 0.0125539 -0.0008002 0.0819262 -0.1970819 0.0104009 -0.0085156 0.0116506 -0.0669286 0.1354418 -0.0619578 -0.0747195 -0.0558468 0.0583686 -0.0194201 -0.1113239 0.0085308 0.1691297 0.1387587 -0.0473526 0.0845052 -0.035785 0.0607499 0.0375701 0.1228175 0.0093307 0.1641398 1.270979 -0.6319965 0.0349273 -0.4232461 1.0040255 -0.060529 0.0180401 -0.0592027 0.1208374 1.2771486 0.4245984 -0.051992 0.1133571 0.9798942 -0.0739892 -0.0256052 -0.0757118 0.1906024 0.0175206 0.0080947 -0.0001475 0.011527 0.0599685 -0.0125066 -0.0321453 -0.0131996 -0.0880531 0.0172413 0.007378 -0.00234 0.0162513 0.0603965 -0.0115884 0.029173 -0.0102145 -0.0890034 1.9081886 -0.0580962 -0.0206798 -0.1635014 1.7453528 -0.1169214 -0.0140102 -0.1189404 0.2804094 0.0088347 -0.0705856 -0.0111608 -0.1215269 -0.0111063 -0.0002286 0.0006142 -0.0151495 0.0424581 -0.0287132 0.1128509 -0.0236166 0.1512786 -0.0688949 0.0398864 -0.0322927 0.0413167 -0.0084361 -0.0303956 0.1137955 0.0052649 0.15306 -0.0776382 -0.0295225 0.0079021 -0.0305788 0.0030437 0.0092945 -0.0679584 0.0217602 -0.1191365 -0.0085326 0.0098663 0.0182215 0.0235929 0.0382784 0.0017873 0.0929182 -0.0519445 0.0949506 -0.0439719 0.0339373 -0.0222713 -0.0097358 0.0925396 0.0057443 -0.09793 -0.0352097 -0.1009493 -0.0625866 -0.0122642 -0.0132617 0.0386398 0.0899885 -0.0077057 0.0104872 0.1352391 0.0080572 0.1042161 -0.0211004 0.1122416 -0.0198087 -0.1097375 0.0083476 -0.090345 0.0514993 -0.0961709 -0.0638452 0.0376364 0.0303711 -0.013102 0.0898613 0.0008856 0.1008622 0.0380273 0.0972699 -0.0432803 -0.0120397 0.0075573 0.0308497 0.0919496 -0.0096904 -0.0120499 -0.1358502 -0.010873 0.1052582 -0.014496 -0.1130449 -0.0153372 -0.1080319 0.1586616 -0.0319011 0.0052686 -0.0422189 0.1444086 0.0162953 0.0065878 0.0165011 0.3321591 0.1614803 -0.0479983 0.0060872 -0.0282285 0.2530975 0.0078679 0.0041726 0.0086366 0.3599597 0.1420366 0.0111104 0.0024804 -0.0210597 0.2633051 0.0074056 0.0048903 0.007074 0.3531223 unknown
polarizability: 135.721623|-5.7048045|111.3626261|-0.3535557|-1.7147297|89.708721 unknown
InChI: InChI=1S/C8H13N3O2/c1-3-8(4-2)5(9)10-7(13)11-6(8)12/h11H,3-4,9H2,1-2H3
charge 0 multiplicity 1
26 atoms
O  -0.678607 -2.420789 0.214806
O  3.336062 -0.112909 -0.040595
N  1.298447 -1.214603 0.082432
N  1.395057 1.203753 -0.114852
N  -0.526641 2.455571 -0.185151
C  -0.876634 0.015108 0.008305
C  -1.781223 0.12136 1.287827
C  -1.793265 -0.086763 -1.264091
C  0.065341 1.223298 -0.097367
C  -0.088152 -1.308783 0.111893
C  -1.004118 0.270145 2.61138
C  -1.028109 -0.145346 -2.601759
C  2.083546 -0.012058 -0.028418
H  -2.394461 -0.798269 1.312234
H  -2.480761 0.972074 1.161154
H  -2.496538 0.770287 -1.265898
H  -2.401332 -1.001438 -1.137462
H  -0.350174 -0.601712 2.792512
H  -0.37423 1.17832 2.61942
H  -1.706407 0.338518 3.460958
H  -0.405898 0.754314 -2.760145
H  -0.368012 -1.030085 -2.647987
H  -1.73776 -0.21766 -3.44484
H  1.833297 -2.087922 0.147419
H  -1.536097 2.575403 -0.179324
H  0.082967 3.270789 -0.258049
