program: Gaussian 09
title: 000238576
version: EM64L-G09RevD.01
frameworkgroup: C1[X(C11H11N3S)]
method: RPBEPBE
basis: SDD
operation: Freq
keyword: #p
keyword: freq=noraman
keyword: PBEPBE/SDD
title: #p freq=noraman PBEPBE/SDD
converged: YES YES NO NO
title: Mulliken charges:
elementType: S N N N C C C C C C C C C C C H H H H H H H H H H H
charge: 0.197941 -0.059239 -0.071387 -0.623999 0.549748 -0.873863 -0.361943 -0.400960 -0.137823 -0.219193 -0.219276 -0.239785 -0.305337 0.234838 -0.367712 0.271971 0.320081 0.260225 0.230401 0.224888 0.224924 0.227685 0.238758 0.243185 0.336169 0.319704
chargesum: 0.00000
title: Mulliken charges with hydrogens summed into heavy atoms:
elementType: S N N N C C C C C C C C C C C
charge: 0.197941 -0.059239 -0.071387 0.031875 0.549748 -0.281811 -0.101718 -0.170559 -0.137823 0.005694 0.005648 -0.012100 -0.066579 0.234838 -0.124526
polarizability: 2.40552060e+02 -1.54967385e+01 1.41689365e+02 5.98518164e+00 5.80981460e+00 1.00443100e+02
1716.lowfreq: -10.9463 -5.8363 -0.8994 -0.0010 0.0009 0.0016 15.8651 31.5381 36.8707
frequency: 14.8808 31.3111 36.8307 103.9695 145.9868 149.7782 200.3674 215.0438 284.7495 345.9448 393.2615 403.1754 423.9065 429.0262 434.8716 472.3776 527.4506 546.4816 553.5570 615.6096 623.2809 630.1320 703.5961 724.3786 754.3331 774.4083 804.2533 849.9082 855.2490 881.7117 891.0254 927.1129 930.9152 943.4222 980.7703 989.4243 997.8209 1018.8963 1026.1370 1075.3046 1080.9155 1170.7639 1177.7211 1186.1637 1222.2388 1237.9470 1256.4691 1277.8334 1327.8658 1332.0653 1384.4801 1384.6865 1438.7702 1441.6666 1447.0013 1482.6636 1496.7505 1566.2884 1592.9724 1612.9484 1620.9525 3026.2441 3110.6561 3116.5002 3124.4043 3136.4992 3146.9206 3153.6906 3157.6239 3162.7847 3548.4112 3703.4738
redmass: 5.7078 4.5539 4.6288 6.2261 5.6119 4.7445 6.6246 5.2207 4.3528 2.1154 5.9598 2.8317 1.5992 4.0598 1.6330 4.2038 1.1301 6.8423 5.5759 6.1074 6.3556 6.5851 1.7137 7.9015 3.6774 2.0500 4.0992 1.6727 1.2524 1.8814 3.8920 5.4909 1.6070 1.4217 1.3807 6.1692 1.3206 1.6702 2.1949 1.9049 1.7890 1.0642 1.0680 1.1110 3.0432 2.3023 1.3785 3.9107 1.2787 1.9425 5.6744 2.7867 2.6400 2.0201 1.1798 2.3383 7.4752 3.3217 6.0838 5.9686 1.4921 1.0597 1.1055 1.0868 1.0867 1.0919 1.0964 1.0922 1.0931 1.1016 1.0450 1.1046
irintensity: 0.2333 3.2178 1.7633 1.8398 0.1553 3.5335 1.0501 2.0606 3.9250 2.5365 1.1802 0.1797 52.6216 12.2107 167.9005 3.4313 96.0382 3.2536 10.9112 3.7307 30.5532 26.4083 57.2116 39.0022 1.8454 28.2509 10.0993 37.3360 0.1743 3.2978 29.8791 24.5367 0.8332 4.9952 0.0850 0.2276 0.2498 8.1215 7.0672 75.4776 25.4570 0.1828 1.5682 2.8548 8.5251 12.4150 17.3666 34.7167 1.3087 22.8375 12.3050 50.5360 10.4872 14.1012 18.4846 16.9212 102.8582 504.5499 0.6852 9.8489 513.6180 29.4623 5.6116 8.6303 0.4373 15.8322 32.5135 25.3294 1.7147 28.5069 116.2165 37.3864
temp: 298.150 k
press: 1.00000 atm
elementType: 16 7 7 7 6 6 6 6 6 6 6 6 6 6 6 1 1 1 1 1 1 1 1 1 1 1
symmnumber: 1
zpe: 525382.1 jmol-1
zpe.correction: 0.200107 hartree
zpe.thermalcorrener: 0.213534 hartree
zpe.thermalcorrenthalpy: 0.214478 hartree
zpe.thermalcorrgfe: 0.157347 hartree
zpe.sumelectzpe: -987.028537 hartree
zpe.sumelectthermal: -987.015111 hartree
zpe.sumelectthermalent: -987.014167 hartree
zpe.sumelectthermalfe: -987.071298 hartree
dipole: -1.7135 -0.7542 -1.8003
dipole: 2.5973
quadrupole: -72.3146 -92.5313 -93.9930
quadrupole: 2.9987 9.9832 -0.5711
quadrupole: 13.9650 -6.2517 -7.7134 2.9987 9.9832 -0.5711
hfenergy: -987.2286449 hartree
pointgroup: C01 [X(C11H11N3S1)]
dipole: 0.6501035 0.6292485 0.474963 debye
dipolederiv: -0.8747842 -0.0742796 0.150681 -0.2520167 -0.1456811 0.078219 0.2758753 0.1737362 -0.2424223 -0.8020532 -0.1875405 0.2552535 -0.0959763 -0.2948645 -0.1722949 0.6471476 -0.0648238 -1.0096074 -0.8427967 -0.2497809 0.0674873 -0.424977 -0.4823378 -0.0671582 -0.1901855 -0.2493574 -0.5337145 -1.4639499 -0.3919173 -0.1389802 -0.5219379 -0.9197892 0.1069636 -0.2289908 0.0569107 -0.1952559 0.1757757 -0.0546516 0.0171469 -0.1239547 -0.0987459 0.0073105 0.0795809 -0.0362622 -0.005245 0.552019 0.0477045 0.1617523 0.1798398 0.1977144 -0.0440421 0.3947716 -0.0306279 0.0407998 -0.0597694 -0.0042748 -0.0673604 0.0517918 -0.1166717 -0.0093358 -0.1147096 -0.0259708 -0.0849818 -0.1585699 -0.0209316 -0.0203465 0.0118939 -0.0723754 -0.1047624 -0.086779 -0.1192288 0.0274946 1.2439256 0.3973965 -0.4549627 0.4449938 0.2191719 0.0121178 -0.9060602 -0.0442807 0.7358572 -0.0842695 -0.0241427 -0.0205395 -0.0313035 -0.0543461 -0.1335996 0.0189784 -0.1180599 0.0651379 0.0760289 -0.0179546 -0.1062467 0.0175735 -0.1122648 -0.0299097 -0.1260281 -0.0357109 -0.0360785 -0.0188919 -0.1002498 0.0095586 -0.071958 -0.0791295 -0.066413 0.0123137 -0.071061 -0.0771254 -1.1448964 -0.3774036 0.1493894 -0.3908856 -0.3035043 0.0926528 0.5246513 0.21862 -0.1522125 1.7018105 0.764526 0.0520678 0.8148617 0.68345 0.1043338 -0.1275632 0.0499715 0.4250127 0.7986033 0.3136607 -0.2568029 0.3718119 0.2182607 0.0904264 -0.281428 0.1625211 0.6318433 -0.0387277 -0.088667 0.0257404 -0.0387187 -0.0186304 0.0628843 -0.0488939 0.107356 0.0238259 0.095634 0.0604348 -0.0475393 0.0269704 0.0836369 -0.0260456 -0.1147442 -0.0818977 0.0384736 0.0314043 0.0090577 0.0923015 -0.0143065 0.1112413 0.0156139 0.1107286 0.0300805 0.0649389 0.1112109 0.0360709 -0.012521 0.0076947 0.0526893 0.1203581 0.006535 0.1192157 -0.0377128 0.0812024 0.0136102 0.0215534 0.0350376 0.0646441 0.124448 -0.0103808 0.1249844 -0.0477574 -0.0883792 0.0106048 0.1076991 0.0184946 0.1284475 0.0353548 0.123791 0.0337083 0.0411753 -0.0684871 0.1072039 -0.0395148 0.1190213 0.0756525 0.0622114 -0.0443029 0.0627163 0.0900518 0.1189158 -0.0406215 0.0061107 -0.0361175 0.1201176 -0.0724342 -0.0127556 -0.0846992 -0.0408342 0.079654 -0.0249783 -0.0186257 -0.0160872 0.0743213 -0.0725951 0.0118883 -0.0719204 -0.066895 0.3058287 -0.0484836 0.0089731 -0.0496605 0.3268218 -0.0615556 -0.0124514 -0.0700695 0.1937978 0.2735618 -0.0543925 0.0577247 -0.0320846 0.3421714 -0.0527482 0.0990117 -0.0358505 0.1514341 unknown
polarizability: 235.386875|22.9281103|104.6196396|-17.9112409|-11.1164368|142.6780107 unknown
InChI: InChI=1S/C11H11N3S/c12-10-6-11(14-8-13-10)15-7-9-4-2-1-3-5-9/h1-6,8H,7,12H2
charge 0 multiplicity 1
26 atoms
S  0.314081 -0.426168 1.725241
N  1.416632 -0.668461 -0.803215
N  3.535687 0.317688 -1.491816
N  4.815077 1.61108 -0.026468
C  -2.181027 -0.698973 0.33241
C  -0.964087 -1.483374 0.755495
C  -2.154076 0.08041 -0.854666
C  -3.372608 -0.734759 1.101646
C  1.576551 -0.123422 0.44219
C  -3.29295 0.809898 -1.258458
C  -4.513637 -0.005201 0.698086
C  -4.476778 0.770634 -0.483315
C  2.696553 0.662268 0.785174
C  3.675719 0.865831 -0.229298
C  2.414252 -0.414956 -1.698523
H  -1.207453 -2.303279 1.448878
H  -0.387677 -1.860229 -0.106041
H  -1.234359 0.10706 -1.450605
H  -3.406007 -1.335841 2.019086
H  -3.260783 1.406257 -2.177487
H  -5.428058 -0.043209 1.301052
H  -5.360616 1.337137 -0.797821
H  2.806741 1.092406 1.784723
H  2.29499 -0.851382 -2.69548
H  5.465652 1.707025 -0.803766
H  5.012884 2.059359 0.863476
