program: Gaussian 09
title: 000238247
version: EM64L-G09RevD.01
frameworkgroup: C1[X(C12H23NO2)]
method: RPBEPBE
basis: SDD
operation: Freq
keyword: #p
keyword: freq=noraman
keyword: PBEPBE/SDD
title: #p freq=noraman PBEPBE/SDD
converged: YES YES NO NO
title: Mulliken charges:
elementType: O O N C C C C C C C C C C C C H H H H H H H H H H H H H H H H H H H H H H H
charge: -0.283114 -0.287926 -0.599658 0.436920 0.352325 0.285435 -0.541865 -0.525638 -0.501398 -0.514820 -0.774394 -0.741739 -0.749893 -0.314303 -0.323353 0.234268 0.182112 0.209164 0.224777 0.214975 0.215689 0.249845 0.200989 0.204222 0.199388 0.249530 0.258187 0.205642 0.185158 0.210964 0.210672 0.213293 0.206334 0.225872 0.204813 0.230006 0.274945 0.272572
chargesum: 0.00000
title: Mulliken charges with hydrogens summed into heavy atoms:
elementType: O O N C C C C C C C C C C C C
charge: -0.283114 -0.287926 -0.052141 0.436920 0.352325 0.285435 -0.125484 -0.091696 -0.070733 -0.063986 -0.121254 -0.092752 -0.114963 0.117904 0.111467
polarizability: 1.52211307e+02 -1.65109552e+00 1.38003285e+02 1.95016494e+00 -2.08753909e-01 1.24515948e+02
1716.lowfreq: -15.6045 -12.9845 -0.0007 -0.0005 0.0001 1.9717 48.2598 92.3072 94.3597
frequency: 48.1285 92.2853 94.3356 108.9383 148.7249 165.7283 180.2764 213.2696 221.1378 229.2557 244.8409 257.5015 280.6885 286.6594 290.8502 308.5011 322.6581 344.0372 357.8377 403.7535 435.5246 461.9035 512.4040 514.0304 550.1254 607.7574 618.8295 665.1342 723.1855 757.2509 774.4418 843.8750 858.4765 865.9420 869.5203 888.5404 906.3770 914.8155 925.0570 927.3718 933.7480 973.4051 982.9243 987.4270 998.0032 1013.5770 1046.3120 1066.8056 1072.4123 1095.6819 1105.6909 1115.2313 1144.8083 1160.1060 1192.9720 1196.6983 1217.3756 1238.4236 1249.4039 1259.4013 1283.4027 1293.1288 1305.5066 1320.9953 1325.6058 1327.0966 1336.6248 1346.1721 1361.7390 1372.6488 1378.3819 1392.9284 1436.9457 1447.2686 1455.2153 1463.1498 1467.3382 1468.6313 1471.0804 1474.2867 1478.6270 1482.9035 1484.4865 1504.4229 1639.3130 2950.9011 2961.6162 2963.2499 2966.2724 2969.9484 2977.9269 2979.8409 2986.3237 2988.1467 3016.1151 3017.7818 3035.8732 3046.9882 3051.0056 3053.2491 3061.9314 3063.5700 3078.2905 3083.6154 3096.8656 3109.0020 3473.5591 3598.0368
redmass: 3.1886 3.2950 2.6006 2.7085 1.2799 2.1431 2.2905 1.3723 1.6498 1.2066 1.4447 2.5109 1.9466 3.2906 2.2652 2.6391 3.6507 2.4632 3.5499 1.6272 2.0187 2.3761 2.8839 3.0549 2.3725 2.3339 1.4538 5.8198 4.3466 3.6660 3.1310 3.0358 2.1248 1.7351 1.7141 2.9158 2.0361 2.1011 2.3537 1.8976 1.4805 2.0193 1.7745 2.5501 1.9382 1.6253 1.8302 1.8144 2.2858 2.2625 1.7163 1.5463 1.7805 1.1565 2.2275 1.4176 2.6668 2.7925 2.6192 2.0778 1.4560 1.3952 1.4063 1.5752 1.3299 1.2578 1.5963 1.5021 1.2794 1.2062 1.2598 1.2114 1.0833 1.0851 1.0691 1.0569 1.0547 1.0887 1.0683 1.0952 1.0593 1.0602 1.0619 1.0659 1.0922 1.0618 1.0394 1.0359 1.0545 1.0401 1.0640 1.0653 1.0612 1.0600 1.0980 1.1026 1.1007 1.1001 1.0997 1.0985 1.0986 1.0992 1.0988 1.0992 1.1016 1.0955 1.0453 1.0979
irintensity: 6.5637 0.7212 7.7544 0.3601 43.2617 4.4511 2.1104 4.7267 0.7186 3.2858 0.2209 4.3942 1.8774 2.6998 0.8811 2.0950 1.3543 0.0491 0.3408 1.9754 0.7126 3.8531 5.1963 10.1817 46.3619 2.2172 127.6825 7.8381 16.1114 8.6948 1.8721 26.7494 1.0526 0.1367 5.9015 3.4036 3.5479 16.7880 41.7721 6.6681 1.3177 3.8935 9.1505 9.9070 21.3846 17.2078 73.5186 57.3447 11.2828 20.8493 5.8502 4.5717 1.0694 1.5335 3.8461 20.6064 20.9454 28.6847 24.2389 1.7271 4.8652 2.7679 1.0507 11.6172 2.6557 1.0232 33.0540 24.8156 5.8057 19.3651 6.1054 13.6227 8.8440 3.5902 1.3555 3.9109 8.7974 7.6536 5.1009 1.4327 5.6921 25.6147 6.9636 19.8782 49.2306 31.9040 42.3028 49.7040 20.2383 45.3554 14.5121 68.5760 67.6110 32.8668 17.3818 39.2299 15.1233 7.2252 32.6820 57.5757 68.7179 50.8689 22.6089 33.5000 34.9121 16.6078 0.3407 1.9913
temp: 298.150 k
press: 1.00000 atm
elementType: 8 8 7 6 6 6 6 6 6 6 6 6 6 6 6 1 1 1 1 1 1 1 1 1 1 1 1 1 1 1 1 1 1 1 1 1 1 1
symmnumber: 1
zpe: 879963.4 jmol-1
zpe.correction: 0.335160 hartree
zpe.thermalcorrener: 0.351685 hartree
zpe.thermalcorrenthalpy: 0.352630 hartree
zpe.thermalcorrgfe: 0.293230 hartree
zpe.sumelectzpe: -675.022567 hartree
zpe.sumelectthermal: -675.006042 hartree
zpe.sumelectthermalent: -675.005098 hartree
zpe.sumelectthermalfe: -675.064497 hartree
dipole: 1.2991 -0.6740 1.7441
dipole: 2.2768
quadrupole: -88.6166 -90.0126 -94.2282
quadrupole: -2.8734 1.5234 -2.5630
quadrupole: 2.3359 0.9398 -3.2757 -2.8734 1.5234 -2.5630
hfenergy: -675.3577274 hartree
pointgroup: C01 [X(C12H23N1O2)]
dipole: -0.5028662 0.2870383 0.6834684 debye
polarizability: 152.0339765|-2.3741148|138.2096696|-1.698223|0.3777175|124.4868938 unknown
InChI: InChI=1S/C12H23NO2/c1-10(2)6-11(3,9-13)8-12(7-10)14-4-5-15-12/h4-9,13H2,1-3H3
charge 0 multiplicity 1
38 atoms
O  -2.484183 0.141342 -1.06628
O  -1.49813 0.313349 1.089096
N  2.842638 1.256187 1.425112
C  1.282931 0.868905 -0.541889
C  0.770908 -1.694815 0.044821
C  -1.179175 0.000591 -0.334216
C  1.705862 -0.631447 -0.613045
C  -0.209547 1.015496 -0.963103
C  -0.692381 -1.450339 -0.434217
C  1.494324 1.510238 0.872495
C  2.16427 1.658008 -1.545895
C  0.864134 -1.70309 1.595704
C  1.210616 -3.097833 -0.458764
C  -3.540895 0.374632 -0.061855
C  -2.776737 1.054076 1.085694
H  2.730809 -0.728309 -0.204039
H  1.780444 -0.892244 -1.690675
H  -0.572567 2.03957 -0.745228
H  -0.28902 0.880031 -2.059738
H  -0.766522 -1.725008 -1.505153
H  -1.396335 -2.09806 0.121405
H  0.676164 1.190551 1.547706
H  1.382278 2.60604 0.747412
H  2.114287 1.219362 -2.56058
H  1.836307 2.7138 -1.615773
H  3.21484 1.64562 -1.204477
H  0.455038 -0.786732 2.047743
H  0.28848 -2.55411 2.00749
H  1.917491 -1.829758 1.915378
H  0.55254 -3.88932 -0.051953
H  1.17401 -3.156908 -1.563053
H  2.246665 -3.322177 -0.141056
H  -3.987819 -0.584895 0.265478
H  -4.308414 1.011046 -0.531744
H  -2.60997 2.130721 0.880704
H  -3.230848 0.921388 2.080211
H  2.92892 0.362628 1.917301
H  3.234385 2.029566 1.967485
