program: Gaussian 09
title: 000238009
version: EM64L-G09RevD.01
frameworkgroup: C1[X(C14H10ClNO3)]
method: RPBEPBE
basis: SDD
operation: Freq
keyword: #p
keyword: freq=noraman
keyword: PBEPBE/SDD
title: #p freq=noraman PBEPBE/SDD
converged: YES YES NO NO
title: Mulliken charges:
elementType: Cl O O O N C C C C C C C C C C C C C C H H H H H H H H H H
charge: -0.066530 -0.287944 -0.424068 -0.311249 -0.469714 0.104770 0.140840 0.467862 0.124786 -0.309895 -0.305550 -0.226858 -0.326437 -0.438823 -0.226280 -0.200909 -0.183510 0.151997 -0.117346 0.377454 0.294412 0.280865 0.243121 0.316360 0.247952 0.243284 0.252953 0.252945 0.395510
chargesum: 0.00000
title: Mulliken charges with hydrogens summed into heavy atoms:
elementType: Cl O O O N C C C C C C C C C C C C C C
charge: -0.066530 -0.287944 -0.028558 -0.311249 -0.092260 0.104770 0.140840 0.467862 0.124786 -0.015483 -0.024685 0.016264 -0.010077 -0.190871 0.017004 0.052044 0.069435 0.151997 -0.117346
polarizability: 3.40131104e+02 1.92913214e+01 1.88323603e+02 1.38450162e+00 -4.29711654e+00 7.06017631e+01
1716.lowfreq: -3.8618 -1.5533 -0.0019 -0.0018 -0.0010 4.9791 25.4840 29.8242 63.1218
frequency: 25.4664 29.8046 63.1163 70.0287 77.4680 106.8916 154.9748 171.6666 210.5473 225.6486 260.7989 308.9642 342.8889 356.3774 387.0994 401.5709 413.2990 419.7262 443.5066 460.1181 516.6488 546.4701 602.0907 616.9430 617.4332 630.5072 663.6005 674.5830 703.0042 708.3735 764.5478 778.9010 795.7553 817.1512 819.4056 847.3548 864.5523 917.5249 930.9579 956.7066 985.0052 992.9940 994.1078 1016.8783 1018.8639 1047.8652 1072.3399 1085.1391 1113.2034 1129.8230 1154.4921 1182.8516 1183.7188 1226.0648 1270.8999 1284.7519 1298.0982 1326.1912 1368.2421 1375.2697 1402.7457 1416.7352 1468.6907 1479.3714 1548.1037 1563.7202 1575.3610 1592.8140 1603.7491 1607.4083 1657.1324 3135.1592 3141.8939 3159.6412 3165.7370 3170.0180 3172.5395 3173.4140 3188.6901 3200.5168 3524.9418
redmass: 5.7688 7.8061 6.1862 7.9331 10.0898 4.8249 8.0506 9.7398 5.8884 8.6100 6.9844 5.7013 6.0328 8.9608 6.1705 7.8593 3.0712 4.6345 5.7237 4.6920 2.9204 5.7128 1.3396 6.0945 4.8522 6.4081 6.2305 4.2844 3.3786 3.5353 5.8138 4.3803 1.5391 1.4942 4.1718 1.4063 5.3967 1.4192 1.2202 1.2938 1.3148 4.3037 1.3833 1.3771 5.4382 3.5365 2.6201 2.7220 1.4088 1.7897 1.9164 1.0790 1.1107 3.4768 1.7814 1.7220 1.5814 2.8088 6.1421 8.2249 4.1261 1.9951 2.4232 2.6005 5.5579 5.1333 6.7873 6.3954 6.0417 6.1103 1.6564 1.0901 1.0870 1.0918 1.0912 1.0872 1.0955 1.0951 1.0963 1.0950 1.0642
irintensity: 1.5470 0.2169 0.6029 0.6251 1.8065 2.4012 0.2218 2.0509 1.3329 2.2177 0.3156 12.0092 1.2521 2.3307 10.8530 15.5068 0.9769 14.9063 16.0834 1.1930 30.4239 8.9645 95.4548 25.2001 34.5959 7.0534 12.0975 2.3121 97.4973 4.1708 10.1392 5.5732 42.5151 12.5482 19.4659 51.1521 24.0624 0.7387 77.4307 61.0760 2.6715 35.2757 6.8148 1.9953 206.9752 14.3247 34.6406 62.5988 54.0512 22.3240 101.1430 4.4960 0.5748 18.4933 12.0653 7.4264 13.1030 98.8616 12.2083 67.4077 12.1801 1.9327 32.4257 227.6628 330.7005 38.8555 43.4820 313.8171 79.1655 3.9432 32.7784 4.8013 5.7524 11.9217 18.2338 474.2493 55.3642 30.9523 8.9611 7.1833 68.4877
temp: 298.150 k
press: 1.00000 atm
elementType: 17 8 8 8 7 6 6 6 6 6 6 6 6 6 6 6 6 6 6 1 1 1 1 1 1 1 1 1 1
symmnumber: 1
zpe: 548952.3 jmol-1
zpe.correction: 0.209085 hartree
zpe.thermalcorrener: 0.225084 hartree
zpe.thermalcorrenthalpy: 0.226028 hartree
zpe.thermalcorrgfe: 0.163459 hartree
zpe.sumelectzpe: -1278.680822 hartree
zpe.sumelectthermal: -1278.664823 hartree
zpe.sumelectthermalent: -1278.663878 hartree
zpe.sumelectthermalfe: -1278.726448 hartree
dipole: -6.0312 2.7647 -0.6153
dipole: 6.6631
quadrupole: -108.6243 -103.1549 -120.8931
quadrupole: -0.8789 1.7348 1.5877
quadrupole: 2.2665 7.7359 -10.0023 -0.8789 1.7348 1.5877
hfenergy: -1278.8899066 hartree
pointgroup: C01 [X(C14H10Cl1N1O3)]
dipole: -2.3608488 -0.7239202 0.8800067 debye
polarizability: 339.5362398|-23.2269601|150.1329218|0.0631403|-55.0241023|109.3873084 unknown
InChI: InChI=1S/C14H10ClNO3/c15-9-5-7-10(8-6-9)16-13(17)11-3-1-2-4-12(11)14(18)19/h1-8,16,18H
charge 0 multiplicity 1
29 atoms
Cl 6.559097 -0.161034 -0.048616
O  -0.036038 1.694228 -1.387119
O  -3.036074 -2.517644 1.359118
O  -0.90137 -1.715327 1.541005
N  0.51133 0.105707 0.232323
C  -1.891303 0.735979 -0.1629
C  -2.651128 -0.3031 0.494628
C  1.925649 0.095079 0.106749
C  -0.390389 0.861647 -0.487098
C  -2.622922 1.836661 -0.689234
C  -4.072928 -0.188123 0.568835
C  -4.021017 1.947742 -0.581408
C  2.655297 0.911054 -0.802194
C  2.630806 -0.798361 0.96307
C  -4.757882 0.922581 0.050464
C  4.063882 0.828587 -0.844388
C  4.03553 -0.880102 0.92033
C  -2.088699 -1.518162 1.147703
C  4.736607 -0.061091 0.012846
H  0.112569 -0.574471 0.91176
H  -2.040426 2.598792 -1.214782
H  -4.629011 -0.994452 1.052108
H  -4.529647 2.824369 -0.996209
H  2.11576 1.592846 -1.460656
H  2.075705 -1.432786 1.663738
H  -5.847478 0.983455 0.135547
H  4.626928 1.454794 -1.542575
H  4.572996 -1.567566 1.579456
H  -2.597245 -3.277705 1.828201
