program: Gaussian 09
title: 000237824
version: EM64L-G09RevD.01
frameworkgroup: C1[X(C15H8Cl2O2)]
method: RPBEPBE
basis: SDD
operation: Freq
keyword: #p
keyword: freq=noraman
keyword: PBEPBE/SDD
title: #p freq=noraman PBEPBE/SDD
converged: NO YES NO NO
title: Mulliken charges:
elementType: Cl Cl O O C C C C C C C C C C C C C C C H H H H H H H H
charge: -0.013168 -0.002921 -0.144736 -0.144485 -0.554933 -0.013442 -0.015206 0.234628 0.235672 0.658686 -0.363710 -0.364000 -0.348410 -0.465415 -0.205383 -0.205359 -0.072946 -0.187008 -0.121855 0.286347 0.281460 0.281474 0.255787 0.240127 0.244488 0.244482 0.259828
chargesum: 0.00000
title: Mulliken charges with hydrogens summed into heavy atoms:
elementType: Cl Cl O O C C C C C C C C C C C C C C C
charge: -0.013168 -0.002921 -0.144736 -0.144485 -0.268586 -0.013442 -0.015206 0.234628 0.235672 0.658686 -0.082250 -0.082526 -0.092623 -0.225289 0.039105 0.039124 -0.072946 0.072820 -0.121855
polarizability: 2.62337004e+02 -2.69780401e+01 1.53711897e+02 6.58848195e-01 3.20514508e-01 1.41446198e+02
1716.lowfreq: -14.6576 -6.6535 -0.0025 -0.0024 -0.0007 2.0332 5.7177 17.6498 45.5400
frequency: -14.5465 17.6320 45.5294 99.6291 113.3102 121.1602 166.3761 184.0575 184.2565 205.5431 234.7620 320.9662 323.9258 353.1084 371.7968 419.6338 433.1250 439.2857 446.0726 521.7537 523.0521 531.2085 559.2514 602.4322 626.3828 663.9088 680.1890 712.4978 719.9285 766.1151 768.2118 807.9064 813.7901 844.2763 889.5335 891.0921 911.5971 950.4506 970.5886 987.3264 1004.6177 1007.4987 1015.3689 1057.3688 1080.8330 1118.9805 1144.0842 1171.1511 1171.7434 1192.8345 1193.5820 1228.2105 1248.1589 1271.5902 1279.6939 1370.0382 1391.9390 1408.5952 1451.8352 1453.1257 1460.4740 1570.8462 1590.1367 1595.0712 1599.3193 1630.7296 1659.8081 2992.6611 3140.3832 3145.0468 3148.9937 3153.2622 3164.2859 3173.2356 3174.2480
redmass: 9.1103 8.1253 9.8397 14.1465 5.9577 5.6995 6.3767 9.7987 11.1687 11.6745 6.9678 6.7242 10.8504 6.2105 6.9391 4.6838 4.2259 3.2360 6.9459 7.2209 7.5477 7.1223 5.8006 3.6072 7.6438 7.3810 5.3369 3.6939 5.2338 1.6982 4.0561 1.7611 3.1605 2.1389 1.8661 5.1967 1.4685 1.5312 3.8867 1.4181 4.8057 2.7599 1.3643 3.0954 2.4827 1.9311 1.6589 1.1163 1.5908 1.6329 1.3312 2.2284 2.1736 2.7945 1.6131 7.0503 2.7303 7.9204 2.5037 2.5415 2.8010 7.6946 7.3980 7.1162 7.4061 10.8208 12.7231 1.0809 1.0866 1.0901 1.0923 1.0902 1.0957 1.0963 1.1005
irintensity: 0.4304 3.0259 0.1311 5.0627 0.5967 0.3351 0.0704 0.0804 0.0856 0.9878 0.0579 0.5075 9.3335 3.5946 1.2933 2.8025 2.0776 5.9731 26.8593 3.6565 0.8614 15.3499 4.7525 1.7832 4.8385 18.3267 0.6047 5.9013 0.3610 69.3160 0.6778 27.4147 44.1888 1.0271 4.0903 28.6519 0.0846 2.7006 6.3037 2.5414 19.7560 26.8574 0.0218 36.3654 1.1539 39.2657 11.4852 23.9817 0.4409 7.7429 9.8436 46.1987 162.9158 114.8948 3.2221 3.5351 22.3580 10.6630 1.1288 0.9497 100.6384 14.4181 151.9727 2.6573 0.9007 190.2726 61.5648 5.1641 1.5527 5.0024 3.3090 2.9481 3.8241 3.1925 24.2005
temp: 298.150 k
press: 1.00000 atm
elementType: 17 17 8 8 6 6 6 6 6 6 6 6 6 6 6 6 6 6 6 1 1 1 1 1 1 1 1
symmnumber: 1
zpe: 482582.0 jmol-1
zpe.correction: 0.183806 hartree
zpe.thermalcorrener: 0.198608 hartree
zpe.thermalcorrenthalpy: 0.199553 hartree
zpe.thermalcorrgfe: 0.140062 hartree
zpe.sumelectzpe: -1645.669414 hartree
zpe.sumelectthermal: -1645.654612 hartree
zpe.sumelectthermalent: -1645.653667 hartree
zpe.sumelectthermalfe: -1645.713158 hartree
dipole: -5.6331 -0.3157 -0.0058
dipole: 5.6419
quadrupole: -102.2841 -114.9442 -134.8053
quadrupole: -14.2835 0.3172 -0.4981
quadrupole: 15.0604 2.4003 -17.4607 -14.2835 0.3172 -0.4981
hfenergy: -1645.8532199 hartree
pointgroup: C01 [X(C15H8Cl2O2)]
dipole: 2.201907 0.2805695 -0.0033665 debye
polarizability: 265.6007456|-19.052025|150.4355445|-0.1603965|-0.5320911|141.4588084 unknown
InChI: InChI=1S/C15H8Cl2O2/c16-11-6-5-8(7-12(11)17)13-14(18)9-3-1-2-4-10(9)15(13)19/h1-7,13H
charge 0 multiplicity 1
27 atoms
Cl -3.26439 -2.853986 -0.008031
Cl -5.688205 -0.629023 -0.012313
O  0.717218 0.85008 -2.420912
O  0.714924 0.78308 2.442113
C  0.20936 1.163718 0.01517
C  1.043892 0.705286 -1.218212
C  1.044793 0.675751 1.236338
C  2.30519 0.088927 -0.708373
C  2.305128 0.070561 0.710834
C  -1.242552 0.718063 0.009485
C  3.3938 -0.424797 -1.444252
C  3.393314 -0.462937 1.433168
C  -1.564411 -0.662206 0.004548
C  -2.292801 1.665452 0.007528
C  4.484964 -0.961353 -0.724181
C  4.484651 -0.980362 0.699476
C  -2.908643 -1.077944 -0.001985
C  -3.639881 1.24897 0.000888
C  -3.950603 -0.125641 -0.003885
H  0.232276 2.272884 0.028457
H  3.380498 -0.404063 -2.538475
H  3.379974 -0.470684 2.52756
H  -0.77631 -1.422725 0.00597
H  -2.064187 2.736347 0.011087
H  5.345326 -1.371024 -1.264235
H  5.344861 -1.404143 1.22878
H  -4.452086 1.981264 -0.000647
