program: Gaussian 09
title: 000237533
version: EM64L-G09RevD.01
frameworkgroup: C1[X(C16H22O3)]
method: RPBEPBE
basis: SDD
operation: Freq
keyword: #pfreq=noraman
keyword: PBEPBE/SDD
title: #p freq=noraman PBEPBE/SDD
converged: YES YES NO NO
title: Mulliken charges:
elementType: O O O C C C C C C C C C C C C C C C C H H H H H H H H H H H H H H H H H H H H H H
charge: -0.278337 -0.197064 -0.214736 -0.394738 -0.473688 -0.033015 -0.284425 -0.720382 -0.711557 0.090199 0.227192 0.299374 -0.358817 -0.342912 -0.265015 -0.228852 -0.258679 -0.223891 -0.660991 0.184678 0.225707 0.217874 0.264153 0.197340 0.252111 0.212298 0.216093 0.209240 0.222711 0.215815 0.205113 0.278469 0.269442 0.222982 0.237457 0.234595 0.231695 0.233840 0.254819 0.225022 0.218881
chargesum: 0.00000
title: Mulliken charges with hydrogens summed into heavy atoms:
elementType: O O O C C C C C C C C C C C C C C C C
charge: -0.278337 -0.197064 -0.214736 0.015647 0.008339 0.164325 -0.032314 -0.082752 -0.067918 0.090199 0.227192 0.299374 -0.080348 -0.073470 0.195424 0.005743 -0.026984 0.009949 0.037731
polarizability: 2.21431362e+02 1.17791924e+01 1.79485659e+02 1.97900242e+01 -1.62404712e+01 1.44762309e+02
1716.lowfreq: -9.6253 -3.4882 -0.0007 -0.0005 0.0004 5.8194 13.6557 25.8922 29.4683
frequency: 12.3168 25.6849 29.4174 43.5378 49.0960 61.4637 86.9855 98.7730 114.8528 135.3216 145.9920 162.2317 192.6085 214.1449 221.2591 238.8354 248.8041 273.4221 313.4345 340.6828 350.6597 358.7339 394.3536 400.9102 428.3611 450.9848 470.2764 543.1576 601.4601 613.7620 646.0029 679.3422 694.8182 709.3897 733.9159 768.8500 785.0105 795.0078 812.6924 843.1447 860.2328 903.2495 909.8493 942.5398 949.2860 954.7160 970.2543 988.0366 990.5271 993.4431 997.6047 1010.9920 1015.3217 1028.4525 1062.8929 1080.9932 1089.7403 1099.0114 1125.4843 1130.7947 1155.7152 1173.7049 1191.9667 1194.2059 1200.4471 1234.6062 1243.7333 1276.4276 1277.4537 1294.1054 1314.5212 1328.0215 1335.1977 1338.0951 1353.3319 1365.7598 1376.7890 1387.3709 1391.8437 1396.1986 1436.3307 1450.9064 1456.4351 1462.5148 1464.4844 1466.7546 1476.9642 1481.0195 1484.1214 1484.3724 1490.1997 1569.3366 1595.6414 1611.1901 1642.3583 2948.3703 2964.5664 2969.6317 2975.8647 2993.1234 3001.6663 3023.6467 3029.1364 3038.2017 3063.6551 3064.0087 3070.6703 3074.3201 3083.9647 3087.5295 3093.6280 3119.2328 3128.9424 3140.7720 3153.5021 3163.2081 3171.2220
redmass: 4.6971 3.9801 3.1980 3.3947 3.0106 3.6950 4.2658 3.6211 2.7822 5.9832 3.9441 4.3006 1.4713 1.3139 2.1840 1.0831 2.1021 3.1092 3.6810 5.3428 2.3926 2.3353 3.0946 2.8318 3.9079 3.3989 5.8467 2.9035 5.1401 6.4091 3.5993 5.7776 2.0116 2.6666 1.9428 2.2493 2.0183 2.8018 1.3720 3.1812 1.2536 3.6283 1.2168 2.3855 1.5216 1.6637 2.1509 2.9541 2.2000 1.6693 2.2216 1.3469 2.8609 2.0880 2.1603 3.0989 1.6957 2.2228 1.8626 2.0815 1.6650 1.0683 1.8371 1.2079 1.4423 2.3338 1.6328 1.3037 1.1868 1.3280 1.3429 1.4076 1.3558 1.3479 1.2842 1.3999 1.2206 8.4070 1.2346 1.2188 2.2664 1.0797 1.0904 1.0456 1.0455 1.0896 1.0586 2.1373 1.0522 1.0522 1.0549 7.0728 6.5830 6.1993 9.1717 1.0703 1.0708 1.0377 1.0385 1.0361 1.0666 1.0927 1.0597 1.0835 1.0997 1.0997 1.0991 1.0993 1.0989 1.0976 1.1030 1.1058 1.0854 1.0888 1.0931 1.0956 1.1004
irintensity: 1.0298 0.9573 0.0322 0.6158 0.4561 0.1405 0.9718 0.5598 0.4901 2.2457 0.6808 0.8778 2.7603 0.3370 1.0772 0.2662 3.7839 0.4043 12.4954 5.6810 0.1263 1.1793 0.7940 0.2200 1.2543 7.7921 3.7756 18.0612 14.0907 0.5452 1.6614 5.7821 45.8289 14.7431 14.1237 31.8703 11.9020 7.3612 5.2188 2.3424 1.2757 15.1828 1.3084 44.8685 2.2010 18.6221 0.5152 0.6834 8.7435 2.1513 24.2762 1.1695 43.0161 0.8053 15.8774 275.3891 17.0991 13.0671 1.4850 7.2487 12.6740 4.1900 5.0541 17.5451 32.6908 167.9391 156.2779 34.2335 19.4805 12.1380 4.4820 2.7519 8.4210 9.0739 2.1771 0.7937 20.7319 4.0555 20.6394 17.9342 21.1097 5.6353 13.3635 16.3536 2.3352 7.7891 2.3784 0.9254 23.4424 15.8392 17.8463 79.9880 26.6759 14.9612 176.6094 16.1505 60.0611 41.9449 13.0017 16.4334 14.9300 29.1452 33.2994 10.6623 18.5695 20.9584 112.1567 53.9206 12.9029 40.0280 1.5174 27.9103 0.2140 12.1533 11.4424 12.9981 21.0087
temp: 298.150 k
press: 1.00000 atm
elementType: 8 8 8 6 6 6 6 6 6 6 6 6 6 6 6 6 6 6 6 1 1 1 1 1 1 1 1 1 1 1 1 1 1 1 1 1 1 1 1 1 1
symmnumber: 1
zpe: 902906.1 jmol-1
zpe.correction: 0.343899 hartree
zpe.thermalcorrener: 0.364590 hartree
zpe.thermalcorrenthalpy: 0.365534 hartree
zpe.thermalcorrgfe: 0.291209 hartree
zpe.sumelectzpe: -847.130508 hartree
zpe.sumelectthermal: -847.109816 hartree
zpe.sumelectthermalent: -847.108872 hartree
zpe.sumelectthermalfe: -847.183197 hartree
dipole: -3.0195 0.9594 -3.3834
dipole: 4.6353
quadrupole: -100.5468 -105.2997 -120.8368
quadrupole: 0.2816 -0.3444 -3.2595
quadrupole: 8.3476 3.5948 -11.9424 0.2816 -0.3444 -3.2595
hfenergy: -847.4744064 hartree
pointgroup: C01 [X(C16H22O3)]
dipole: -0.7618807 -0.9038165 1.3886503 debye
polarizability: 219.7915745|8.1122272|179.585224|-17.111465|-23.5640617|146.3025312 unknown
InChI: InChI=1S/C16H22O3/c1-4-19-16(18)14(11-10-12(2)3)15(17)13-8-6-5-7-9-13/h5-9,12,14H,4,10-11H2,1-3H3
charge 0 multiplicity 1
41 atoms
O  0.644656 -2.546951 0.675008
O  -0.144747 1.439362 -1.228231
O  1.196799 -1.882513 -1.495276
C  2.414122 1.842718 0.775539
C  2.237349 0.543657 -0.043528
C  3.719961 2.633499 0.472226
C  0.900968 -0.176592 0.279464
C  4.994978 1.825386 0.817827
C  3.765837 3.145976 -0.988196
C  -0.318392 0.599026 -0.302039
C  0.927542 -1.590617 -0.310176
C  -1.690252 0.335977 0.250013
C  -2.77842 1.07024 -0.299742
C  -1.942598 -0.604052 1.287088
C  0.635527 -3.978432 0.228144
C  -4.088027 0.874487 0.177499
C  -3.257106 -0.797868 1.763716
C  -4.331169 -0.060361 1.213841
C  -0.724445 -4.356989 -0.364272
H  2.394805 1.593464 1.858064
H  1.551228 2.509531 0.581433
H  3.070593 -0.152746 0.168792
H  2.249915 0.760785 -1.124838
H  3.701627 3.524216 1.136479
H  0.77643 -0.275265 1.372444
H  5.898609 2.453674 0.7084
H  5.114485 0.955448 0.145405
H  4.965258 1.450962 1.85893
H  2.849684 3.709809 -1.243502
H  3.854894 2.309668 -1.70594
H  4.635291 3.811968 -1.143066
H  -2.564595 1.786002 -1.100321
H  -1.126441 -1.196004 1.711715
H  0.859294 -4.535697 1.15176
H  1.44688 -4.116377 -0.508053
H  -4.918732 1.444927 -0.251936
H  -3.444481 -1.522499 2.563681
H  -5.349821 -0.212391 1.588293
H  -0.91741 -3.795167 -1.293203
H  -1.539444 -4.154174 0.35201
H  -0.736454 -5.436191 -0.605453
