program: Gaussian 09
title: 000234866
version: EM64L-G09RevD.01
frameworkgroup: C1[X(C10H9FN2O2)]
method: RPBEPBE
basis: SDD
operation: Freq
keyword: #p
keyword: freq=noraman
keyword: PBEPBE/SDD
title: #p freq=noraman PBEPBE/SDD
converged: YES YES NO NO
title: Mulliken charges:
elementType: F O O N N C C C C C C C C C C H H H H H H H H H
charge: -0.202510 -0.210683 -0.224049 -0.434049 -0.397198 0.037667 0.470404 0.182396 -0.689716 0.164050 -0.316490 -0.376490 -0.388178 -0.367767 0.323129 0.330445 0.230861 0.236700 0.246484 0.353548 0.258545 0.255369 0.258659 0.258873
chargesum: 0.00000
title: Mulliken charges with hydrogens summed into heavy atoms:
elementType: F O O N N C C C C C C C C C C
charge: -0.202510 -0.210683 -0.224049 -0.103603 -0.043650 0.037667 0.470404 0.182396 0.024330 0.164050 -0.057945 -0.121121 -0.129519 -0.108894 0.323129
polarizability: 1.56761585e+02 -1.03934629e+01 1.27468197e+02 6.59464163e-01 -2.47344391e+00 7.97568010e+01
1716.lowfreq: -10.9186 -9.3035 0.0008 0.0009 0.0010 6.7647 35.6467 53.4362 79.8116
frequency: 35.4735 53.4165 79.8011 155.1232 161.9672 198.3799 218.2738 227.5402 295.3703 311.9311 352.8691 393.3110 399.8689 412.6938 477.8220 494.1160 521.4446 568.8387 605.6757 614.9588 628.8385 648.3902 684.6124 711.9821 722.4155 746.4789 791.1953 818.4759 835.5475 855.2135 942.9903 948.1255 962.1765 974.8900 1004.6096 1065.9359 1091.3643 1107.5677 1148.4457 1159.7696 1201.7884 1210.8324 1234.6620 1294.3787 1308.6393 1316.9983 1355.7868 1374.7268 1390.6534 1403.3777 1464.6060 1470.4625 1492.4785 1600.4069 1610.9949 1683.3100 1724.4379 2995.6288 3096.9058 3110.2431 3153.8310 3158.0977 3177.2319 3180.7585 3586.2742 3600.4170
redmass: 4.0657 8.4511 8.7067 5.9704 8.6463 2.3465 1.4772 2.9848 7.1971 5.3977 6.3425 6.5696 5.1542 3.0351 2.4232 1.4946 3.0272 4.8096 10.0028 4.7118 5.9421 1.3027 4.5969 4.9439 5.2965 4.9381 5.7428 1.2594 1.7398 2.6174 1.7111 1.5983 1.3629 2.7256 2.9467 2.4869 2.4091 1.5868 2.6220 1.5452 1.9441 3.9941 4.4683 1.2627 2.7943 2.7875 1.6745 7.0742 1.2390 3.5095 1.0771 1.0547 2.4377 7.7812 6.4117 8.5296 9.5172 1.0350 1.1017 1.1001 1.0885 1.0888 1.0962 1.0973 1.0802 1.0800
irintensity: 0.1811 0.1436 1.4391 0.3907 2.9595 0.7003 2.1363 3.2764 1.8202 1.0068 3.2558 9.5756 4.5681 1.4611 19.1556 111.6567 19.0292 16.9166 15.0098 1.4207 3.5940 154.8774 3.8876 12.3269 40.4222 14.3785 26.1798 1.4507 53.9916 24.3430 5.6144 2.2902 1.4969 14.5749 16.6066 13.6449 31.5003 1.8682 7.2628 53.1520 22.2852 23.0371 125.3255 3.7560 170.3036 72.7401 10.6286 5.9451 13.6890 7.5468 3.2522 13.9159 111.1707 9.7083 24.1371 502.8077 416.2986 15.1739 21.5476 12.5968 3.2361 3.2589 3.5505 1.6289 78.0509 39.5351
temp: 298.150 k
press: 1.00000 atm
elementType: 9 8 8 7 7 6 6 6 6 6 6 6 6 6 6 1 1 1 1 1 1 1 1 1
symmnumber: 1
zpe: 464305.6 jmol-1
zpe.correction: 0.176845 hartree
zpe.thermalcorrener: 0.189755 hartree
zpe.thermalcorrenthalpy: 0.190699 hartree
zpe.thermalcorrgfe: 0.136855 hartree
zpe.sumelectzpe: -745.224033 hartree
zpe.sumelectthermal: -745.211122 hartree
zpe.sumelectthermalent: -745.210178 hartree
zpe.sumelectthermalfe: -745.264022 hartree
dipole: 0.0322 0.5097 2.5383
dipole: 2.5891
quadrupole: -102.5502 -90.0097 -82.2794
quadrupole: 5.3953 0.2232 1.1628
quadrupole: -10.9371 1.6034 9.3337 5.3953 0.2232 1.1628
hfenergy: -745.4008773 hartree
pointgroup: C01 [X(C10H9F1N2O2)]
dipole: 0.016913 -1.0106684 0.1260575 debye
dipolederiv: -1.1793648 -0.217507 0.0078196 -0.2460659 -0.2084232 -0.0120722 -0.0011632 -0.0147024 -0.1998366 -0.5001487 0.0573101 0.0395673 0.1229401 -0.4077957 0.1219171 0.0569204 0.0741192 -1.0804996 -0.8765589 0.2618851 0.377303 0.2947554 -0.5184835 -0.1417668 0.5428296 -0.1975674 -0.9230408 -1.0560734 0.2765543 0.0919807 0.3023521 -0.7247697 -0.0931339 0.039855 -0.1082881 -0.3907879 -0.6756578 0.0960334 0.426561 0.2536638 -0.4396951 -0.1276454 0.3022505 0.0484913 -1.2390445 0.2902904 0.1540975 -0.2024762 0.1825664 0.1408215 0.1527385 -0.4676553 0.2702263 0.2229269 0.2467361 0.0225668 0.0679679 0.0689133 -0.1390842 -0.0026527 -0.0109116 -0.0394109 -0.1688469 0.8357304 -0.3670752 -0.4253345 -0.6451023 0.5091735 0.116889 -0.145407 -0.0749975 1.3828002 -0.0599042 -0.018405 0.0173365 -0.0045603 0.015379 -0.0828015 0.0747588 -0.0272752 -0.0193734 1.3369633 -0.6529242 -0.4442712 -0.7707665 0.8681766 -0.050699 -0.6210247 -0.0183483 1.6597893 -0.0047866 0.0394307 0.0065888 0.0134443 -0.0915274 0.0095799 0.0404885 0.0622946 0.0647935 -0.0424628 0.0286778 -0.0117516 0.0332034 -0.100832 0.0730548 0.0112534 0.0577507 0.0382419 -0.2188488 -0.0068761 -0.0323829 -0.071605 -0.1564823 0.0196924 -0.1984221 -0.0132899 -0.0229676 -0.2379154 -0.014343 0.0142924 0.0300498 -0.1248793 0.0392884 0.1735027 0.0712141 -0.0327006 1.2716647 0.2553793 -0.015771 0.2812735 0.1655399 0.0420087 0.0079108 0.0354632 0.241337 0.29137 0.0870819 0.0090571 0.1302918 0.2463933 0.0082797 0.0497807 0.0109116 0.1762286 0.0588379 0.0784946 -0.071185 0.0640605 -0.0161086 0.0480771 -0.0647896 0.080302 0.0114827 -0.1453337 -0.0802776 -0.005058 -0.063068 0.0548099 -0.0082109 0.0005469 -0.0012888 0.1010827 0.0930919 0.023235 0.0772472 0.0359097 0.0697645 0.0160917 0.0849691 -0.0415339 -0.0492431 0.2931971 0.0705653 0.0313822 0.0655842 0.3015798 0.0200887 0.0808113 0.003509 0.167412 0.0926592 -0.0410479 -0.0684429 -0.0301091 0.1130453 -0.0358663 -0.0653987 -0.0558151 0.0264516 0.0938209 -0.0022779 0.0887528 0.0153736 0.1252851 -0.0265771 0.0887125 -0.0332549 -0.0012418 0.039241 -0.0098656 0.0639187 -0.0155711 0.1672976 -0.0273716 0.0775798 -0.0270786 0.0179595 0.0534523 -0.0407123 -0.043102 -0.0475341 0.1508149 -0.0589085 -0.0573976 -0.0614311 0.0170771 unknown
polarizability: 154.4031441|-0.2077261|83.0142215|-13.3730218|12.3169898|126.5692175 unknown
InChI: InChI=1S/C10H9FN2O2/c1-10(8(14)12-9(15)13-10)6-2-4-7(11)5-3-6/h2-5,12-13H,1H3
charge 0 multiplicity 1
24 atoms
F  4.597965 0.684112 0.106436
O  -1.602354 0.424531 -2.078124
O  -3.429057 0.866528 2.246707
N  -1.663192 -0.477271 1.377102
N  -2.686211 0.936359 -0.028912
C  -0.985658 -0.712697 0.087214
C  0.50861 -0.328163 0.10826
C  -1.769321 0.27662 -0.846314
C  -1.200012 -2.167863 -0.408474
C  -2.671807 0.476755 1.329034
C  1.285063 -0.472095 -1.072073
C  1.121743 0.183269 1.277789
C  2.653574 -0.132886 -1.081604
C  2.493279 0.522813 1.288952
C  3.229231 0.350858 0.106249
H  -1.513814 -1.042229 2.211159
H  -0.649815 -2.875243 0.236749
H  -2.273373 -2.424903 -0.393041
H  -0.832545 -2.279304 -1.441388
H  -3.338579 1.65276 -0.348921
H  0.815553 -0.819125 -1.997325
H  0.527631 0.334096 2.183968
H  3.261728 -0.231748 -1.985151
H  2.979461 0.916228 2.186208
