program: Gaussian 09
title: 000019615
version: EM64L-G09RevD.01
frameworkgroup: C1[X(C12H13ClN2)]
method: RPBEPBE
basis: SDD
operation: Freq
keyword: #p
keyword: freq=noraman
keyword: PBEPBE/SDD
title: #p freq=noraman PBEPBE/SDD
converged: YES YES NO NO
title: Mulliken charges:
elementType: Cl N N C C C C C C C C C C C C H H H H H H H H H H H H H
charge: -0.090959 -0.084686 -0.469539 0.126006 0.174750 -0.477803 -0.458047 -0.376403 0.165362 0.216524 -0.622482 -0.401317 -0.350814 -0.107697 -0.217588 0.207901 0.239966 0.232848 0.194242 0.196185 0.218297 0.301135 0.189201 0.226090 0.227716 0.257821 0.233925 0.249367
chargesum: 0.00000
title: Mulliken charges with hydrogens summed into heavy atoms:
elementType: Cl N N C C C C C C C C C C C C
charge: -0.090959 -0.084686 -0.168404 0.126006 0.174750 -0.029936 -0.030958 0.038079 0.165362 0.216524 0.020524 -0.143496 -0.116889 -0.107697 0.031779
polarizability: 2.26109063e+02 -1.02584587e+01 1.56400503e+02 -4.74365095e-01 -1.16109066e+00 7.75841481e+01
1716.lowfreq: 0.0003 0.0012 0.0015 2.6950 5.1269 11.1838 65.5269 80.4871 119.0783
frequency: 65.5119 80.4711 119.0770 157.0157 175.1782 213.9823 229.0004 264.6531 303.2953 312.3575 330.5754 348.4233 361.3084 388.5853 424.3367 489.5226 495.7915 515.7496 566.3043 584.1035 638.1555 664.7159 682.4278 740.4200 761.8735 786.6688 790.4874 833.9656 867.7543 894.9979 923.8458 967.4500 971.6879 998.9666 1045.7943 1049.2010 1056.9258 1112.7781 1116.0024 1133.7382 1169.4061 1172.4890 1181.4489 1224.0059 1238.3044 1242.2166 1270.1070 1287.2575 1293.7528 1337.6417 1348.7138 1375.7963 1405.2833 1433.4846 1436.9994 1452.5256 1460.4627 1463.3852 1465.5823 1475.8268 1482.5689 1485.3022 1572.4094 1602.2964 1634.8206 2809.4552 2845.1287 2860.6496 2970.5439 2988.3828 3017.9710 3021.6381 3039.7426 3076.5021 3138.7164 3163.6111 3174.7092 3607.9306
redmass: 3.5195 4.1769 6.2593 3.5993 2.7059 2.3635 1.3742 3.5471 2.9113 4.3671 3.5271 4.8781 2.6128 5.9186 2.8921 2.8078 1.3504 3.8365 3.6851 3.8035 4.6463 6.5624 4.8130 3.8249 2.8100 4.1058 1.5208 3.6285 1.4495 3.0831 1.3318 2.3178 2.3855 2.0022 1.8839 2.2614 2.0063 2.0415 1.6201 1.5072 2.1408 1.6725 1.1706 1.5154 1.8297 1.7303 1.9511 1.7744 1.7419 1.8710 1.6377 1.6115 3.4656 1.1973 2.0463 1.4386 3.2356 1.1294 1.0957 1.6284 1.2030 1.7588 7.2091 7.7133 6.8303 1.0717 1.0665 1.0613 1.0587 1.0849 1.0725 1.1004 1.0899 1.1009 1.0899 1.0928 1.0955 1.0805
irintensity: 1.4896 0.2491 0.3535 1.4568 2.8525 2.9343 0.5797 0.6744 5.0163 2.2555 1.9582 0.1151 0.7272 4.7143 6.4926 17.3461 72.9640 3.3313 12.7735 15.8553 1.8691 16.7854 19.2039 0.9954 9.9119 6.6759 53.9125 8.5414 19.7663 11.8852 0.4038 12.6842 15.2778 6.3789 11.4209 26.8695 7.4530 21.1017 30.9410 5.4203 2.3498 0.2295 2.0496 15.5617 13.4856 12.8853 9.6493 14.6035 7.1759 30.4109 7.7966 14.3344 41.6273 2.5592 32.2349 3.8984 9.0723 26.6748 2.1349 19.2621 29.5809 29.9614 18.1327 33.4027 3.0973 66.6028 52.8280 225.8400 52.9803 26.2907 50.4216 28.3543 55.2971 33.5735 9.9807 1.8404 4.7048 52.6277
temp: 298.150 k
press: 1.00000 atm
elementType: 17 7 7 6 6 6 6 6 6 6 6 6 6 6 6 1 1 1 1 1 1 1 1 1 1 1 1 1
symmnumber: 1
zpe: 590298.3 jmol-1
zpe.correction: 0.224833 hartree
zpe.thermalcorrener: 0.237721 hartree
zpe.thermalcorrenthalpy: 0.238665 hartree
zpe.thermalcorrgfe: 0.185626 hartree
zpe.sumelectzpe: -1033.554087 hartree
zpe.sumelectthermal: -1033.541199 hartree
zpe.sumelectthermalent: -1033.540254 hartree
zpe.sumelectthermalfe: -1033.593294 hartree
dipole: -4.1520 2.8864 0.6983
dipole: 5.1047
quadrupole: -96.4271 -79.8836 -100.8312
quadrupole: 4.8661 -2.7861 -0.4569
quadrupole: -4.0465 12.4970 -8.4505 4.8661 -2.7861 -0.4569
hfenergy: -1033.77892 hartree
pointgroup: C01 [X(C12H13Cl1N2)]
dipole: -1.5238579 1.2849427 0.2452678 debye
polarizability: 223.666878|-16.4179014|158.7679616|0.1555704|-2.7533534|77.6588746 unknown
InChI: InChI=1S/C12H13ClN2/c1-15-5-4-12-10(7-15)9-6-8(13)2-3-11(9)14-12/h2-3,6,14H,4-5,7H2,1H3
charge 0 multiplicity 1
28 atoms
Cl 4.358805 -2.0547 0.117886
N  -3.072709 -0.860315 -0.271289
N  -0.038732 2.001223 -0.084866
C  -0.729046 -0.171581 0.017116
C  -1.156959 1.151429 -0.044526
C  -2.594359 1.581467 -0.061862
C  -1.698764 -1.323631 0.062337
C  -3.452551 0.388471 0.43234
C  0.717131 -0.15844 0.021118
C  1.127597 1.225264 -0.045382
C  -4.064565 -1.937608 -0.106176
C  1.709606 -1.173961 0.070848
C  2.484764 1.606833 -0.060329
C  3.051724 -0.768958 0.053691
C  3.460684 0.588424 -0.009756
H  -2.769601 2.460592 0.590572
H  -2.910171 1.856348 -1.087508
H  -1.413311 -2.104554 -0.670282
H  -1.668001 -1.809006 1.075232
H  -3.340567 0.292779 1.543434
H  -4.51889 0.588571 0.222372
H  -0.073205 3.01721 -0.1297
H  -4.176565 -2.283511 0.953238
H  -3.766667 -2.809988 -0.715711
H  -5.052746 -1.596254 -0.462448
H  1.444262 -2.233791 0.121374
H  2.790557 2.657357 -0.110958
H  4.525382 0.837129 -0.020065
