program: Gaussian 09
title: 000228160
version: EM64L-G09RevD.01
frameworkgroup: C1[X(C8H18N6O3)]
method: RPBEPBE
basis: SDD
operation: Freq
keyword: #p
keyword: freq=noraman
keyword: PBEPBE/SDD
title: #p freq=noraman PBEPBE/SDD
converged: YES YES NO NO
title: Mulliken charges:
elementType: O O O N N N N N N C C C C C C C C H H H H H H H H H H H H H H H H H H
charge: -0.287858 -0.252201 -0.304552 -0.043929 -0.330591 -0.370183 -0.034128 -0.031794 0.074638 -0.578284 -0.469591 0.310435 0.229975 -0.612884 -0.607577 -0.606782 -0.615876 0.275488 0.261518 0.246816 0.282742 0.345755 0.355492 0.237237 0.203012 0.249175 0.269281 0.208315 0.228957 0.267905 0.223257 0.196472 0.224450 0.236474 0.218838
chargesum: 0.00000
title: Mulliken charges with hydrogens summed into heavy atoms:
elementType: O O O N N N N N N C C C C C C C C
charge: -0.287858 -0.252201 -0.304552 -0.043929 0.015164 -0.014691 -0.034128 -0.031794 0.074638 -0.041278 0.059966 0.310435 0.229975 0.076540 0.098976 0.080851 0.063886
polarizability: 1.94683802e+02 1.73243430e+00 1.56265418e+02 -8.15664976e+00 -3.52338937e+00 1.09282235e+02
1716.lowfreq: -6.0151 -5.4812 -0.0002 0.0004 0.0006 3.1518 14.6609 30.8051 39.8244
frequency: 14.3911 30.6997 39.7312 46.2153 76.2392 82.1175 99.6849 106.8200 121.1216 166.7730 186.4262 196.9549 215.2559 217.3766 230.1810 241.4766 249.5828 270.4686 321.6089 347.9099 349.0791 353.6621 381.9725 401.9406 427.1706 436.8229 445.0441 450.0055 559.7629 596.2157 627.6252 682.1059 692.0283 723.6554 753.2698 828.6652 833.2975 851.6161 891.5983 915.9621 931.1204 941.2351 1008.4804 1013.0315 1026.6766 1045.5794 1081.0066 1089.0211 1090.1621 1131.7485 1134.4513 1152.7915 1221.5512 1222.2402 1243.0004 1245.5270 1249.6333 1259.2228 1265.3695 1302.6845 1310.5617 1335.2465 1344.0997 1413.0243 1415.8225 1423.8869 1428.1691 1429.0096 1433.1611 1457.7385 1459.5224 1465.3467 1466.6288 1474.3085 1474.9874 1483.5920 1484.8082 1520.4912 1551.2863 1613.6148 1623.0384 2887.4304 2899.2325 2907.5038 2918.2233 3002.1486 3010.4478 3042.0881 3050.2284 3050.3227 3058.4589 3097.4192 3097.8422 3105.6055 3107.7023 3111.8590 3112.9134 3195.2373 3292.2497
redmass: 4.1905 3.7506 3.3528 3.2629 5.2797 4.7454 4.3640 5.1110 3.4647 5.9202 2.9403 3.2708 1.1347 1.1938 1.3779 1.2074 2.4817 5.5791 3.0686 4.2568 3.9342 3.1885 2.2125 4.0975 5.1403 2.9067 3.6858 2.8338 4.3244 4.9661 4.7322 1.3807 3.5683 5.5671 1.1319 4.6834 4.9782 5.8464 3.9844 2.7835 3.6814 3.4790 2.0104 1.7165 2.0883 2.5326 2.2368 1.2426 1.2659 1.4409 1.4124 1.9812 2.9431 2.8956 3.4047 2.7135 2.5475 3.5931 2.0091 2.6491 1.4684 1.4464 1.3376 1.1383 1.1388 1.1062 1.1438 1.1341 1.1096 1.0574 1.0534 1.0646 1.0584 1.0494 1.0483 1.0530 1.0540 1.5653 1.4430 7.2403 8.4996 1.0548 1.0517 1.0515 1.0501 1.0648 1.0629 1.0789 1.0796 1.0757 1.0816 1.1012 1.0962 1.1017 1.1018 1.1020 1.0995 1.0857 1.0791
irintensity: 2.2308 1.4502 2.0904 0.2784 4.8435 5.3221 4.1074 12.2285 2.0672 4.4661 10.1902 5.3771 0.6841 0.4160 3.5795 1.3966 6.2306 11.1108 15.0585 9.3892 2.1740 4.3395 3.2482 3.3443 2.5579 1.9231 2.3001 2.4480 12.3496 16.5751 14.4805 182.5563 63.0077 19.2074 102.8293 14.7814 24.4525 27.1270 24.4566 5.7647 20.4935 0.6661 40.4042 9.0371 69.9764 56.4823 7.8774 3.0570 2.3980 1.0699 1.9303 10.0469 18.7739 5.0574 27.3886 6.6675 3.9729 27.9149 75.7105 72.6539 5.0908 10.0746 6.4104 6.3937 7.1344 7.3833 20.7368 16.0858 22.4097 21.9176 23.5387 10.2318 9.8424 11.1290 4.6253 31.9271 27.6844 47.0808 41.0820 353.8670 191.2476 100.0856 58.3218 119.9289 85.5804 14.4521 12.3673 27.7274 44.2216 17.8267 24.7767 26.7566 0.2694 24.2068 10.5824 25.6998 2.0625 415.0768 28.3079
temp: 298.150 k
press: 1.00000 atm
elementType: 8 8 8 7 7 7 7 7 7 6 6 6 6 6 6 6 6 1 1 1 1 1 1 1 1 1 1 1 1 1 1 1 1 1 1
symmnumber: 1
zpe: 739724.8 jmol-1
zpe.correction: 0.281746 hartree
zpe.thermalcorrener: 0.301609 hartree
zpe.thermalcorrenthalpy: 0.302553 hartree
zpe.thermalcorrgfe: 0.231488 hartree
zpe.sumelectzpe: -868.338552 hartree
zpe.sumelectthermal: -868.318689 hartree
zpe.sumelectthermalent: -868.317745 hartree
zpe.sumelectthermalfe: -868.388811 hartree
dipole: 4.6282 -1.7401 2.6362
dipole: 5.6033
quadrupole: -104.5559 -102.0844 -104.0638
quadrupole: 2.2189 -9.2849 14.1275
quadrupole: -0.9878 1.4836 -0.4958 2.2189 -9.2849 14.1275
hfenergy: -868.6202983 hartree
pointgroup: C01 [X(C8H18N6O3)]
dipole: -1.5221398 1.3435645 0.8589803 debye
polarizability: 194.700738|-4.5355851|149.7833288|-7.1611266|-16.4708263|115.7473881 unknown
InChI: InChI=1S/C8H18N6O3/c1-12(2)9-7(15)5-14(11-17)6-8(16)10-13(3)4/h9-10H,5-6H2,1-4H3
charge 0 multiplicity 1
35 atoms
O  -0.095985 1.655802 1.004974
O  3.407035 -1.866516 -0.106168
O  -2.148794 -2.122006 1.094632
N  0.012165 -1.576992 1.401297
N  -2.259156 0.741275 1.104017
N  2.082909 0.066343 -0.028837
N  -2.881738 1.771758 0.342177
N  2.930355 0.786509 -0.931402
N  -0.91523 -2.455353 0.86494
C  -0.43905 -0.441176 2.240034
C  1.423817 -1.985462 1.262678
C  -0.923012 0.768096 1.40098
C  2.37796 -1.238723 0.284307
C  -4.324285 1.832996 0.649949
C  -2.550131 1.685218 -1.104177
C  4.15089 1.295557 -0.258411
C  2.152905 1.806798 -1.664257
H  -1.24819 -0.807328 2.899179
H  0.414777 -0.10062 2.845456
H  1.899509 -1.978598 2.262496
H  1.413212 -3.027891 0.904295
H  -2.739317 -0.169001 1.242708
H  1.320717 0.606239 0.4330
H  -4.754801 2.696125 0.115807
H  -4.885012 0.916885 0.341917
H  -4.462637 1.990746 1.732064
H  -1.455963 1.745046 -1.21896
H  -2.924735 0.752376 -1.584585
H  -2.997849 2.55661 -1.610638
H  4.689366 0.440574 0.181224
H  4.801001 1.754645 -1.022998
H  3.935607 2.050652 0.533782
H  2.825421 2.289691 -2.393399
H  1.338155 1.312154 -2.219714
H  1.712586 2.594173 -1.007767
