program: Gaussian 09
title: 000251218
version: EM64L-G09RevD.01
frameworkgroup: C1[X(C13H22O3)]
method: RPBEPBE
basis: SDD
operation: Freq
keyword: #pfreq=noraman
keyword: PBEPBE/SDD
title: #p freq=noraman PBEPBE/SDD
converged: NO YES NO NO
title: Mulliken charges:
elementType: O O O C C C C C C C C C C C C C H H H H H H H H H H H H H H H H H H H H H H
charge: -0.458345 -0.262518 -0.254531 0.368091 -0.201802 -0.553127 -0.346912 -0.534454 -0.430128 -0.351147 -0.690256 0.267528 -0.691145 -0.370035 -0.034038 -0.533850 0.229710 0.236960 0.209425 0.267624 0.276184 0.246319 0.197956 0.208798 0.197622 0.206202 0.238215 0.223975 0.215460 0.342291 0.218608 0.210551 0.208794 0.236187 0.227104 0.230186 0.220113 0.228384
chargesum: 0.00000
title: Mulliken charges with hydrogens summed into heavy atoms:
elementType: O O O C C C C C C C C C C C C C
charge: -0.116055 -0.262518 -0.254531 0.368091 0.027908 -0.106743 -0.100593 0.009355 -0.023373 0.052677 -0.012606 0.267528 -0.053192 0.093256 0.196147 -0.085352
polarizability: 1.84656448e+02 6.88252047e+00 1.45444018e+02 -8.74653983e+00 -7.01558485e+00 1.25292708e+02
1716.lowfreq: -7.3897 -0.0007 -0.0003 0.0002 1.2736 11.9637 20.0104 22.9115 33.6288
frequency: 19.5555 21.8779 33.5985 50.4882 50.8205 73.2945 77.8868 92.1871 101.8586 120.7835 141.9640 183.4027 200.4908 220.5238 228.4252 246.6234 265.4653 298.4268 315.6649 336.8081 354.9578 387.6441 394.2916 432.6724 444.5419 464.6304 557.1831 586.2553 624.0796 659.8726 667.7460 733.2725 760.0523 796.2374 833.7435 848.9664 882.9211 890.8333 906.2764 924.2654 944.1082 957.5191 964.8912 971.0864 1004.8195 1009.7231 1028.1123 1038.6683 1057.9059 1060.3250 1074.5448 1096.4749 1110.2533 1128.7353 1161.4285 1169.2840 1193.3894 1229.3326 1235.0582 1244.7911 1261.3362 1267.5703 1285.3041 1285.7905 1300.1847 1310.2614 1325.5690 1338.4280 1341.4368 1363.1894 1367.1397 1389.4445 1389.9284 1426.5431 1433.0824 1454.9301 1456.2015 1471.2623 1471.9579 1476.9033 1480.9827 1484.3708 1498.3663 1638.2923 1660.3911 1671.5624 2944.7791 2953.1237 2971.7714 2973.5578 2981.4719 2984.0291 3001.5262 3010.1922 3027.8496 3033.6825 3039.0873 3068.8551 3072.7672 3075.9602 3077.8076 3084.2876 3087.5966 3092.3226 3098.4005 3119.1013 3204.3832 3553.8511
redmass: 3.5794 3.6438 3.3530 2.8445 3.1372 4.0265 2.4589 3.5592 2.6126 2.7571 4.4513 2.8370 1.1339 2.9941 1.1098 3.5832 2.5494 3.6787 3.1847 2.7687 2.4574 1.1439 2.7967 2.5844 3.1400 3.3031 3.0471 3.1593 3.1489 2.3402 3.6979 1.1625 1.8256 1.3388 5.4526 1.4021 1.7846 2.3192 1.4159 1.8326 2.2766 2.5864 1.7009 1.6119 1.2079 2.7849 2.7659 2.4479 2.0780 2.0547 1.6455 2.0516 2.1523 2.5200 2.0028 1.6572 1.6101 1.3569 1.1934 1.1811 1.2032 1.2438 1.2352 1.1195 1.3915 1.3625 1.3468 1.2710 1.5078 1.5695 1.5821 1.2132 1.2255 1.1579 1.0880 1.1279 1.0837 1.0521 1.0555 1.0431 1.0441 1.0714 1.0969 9.1709 4.6497 7.3181 1.0653 1.0836 1.0398 1.0564 1.0363 1.0602 1.0644 1.0933 1.0569 1.1001 1.0990 1.1005 1.0992 1.0990 1.0893 1.1004 1.0958 1.0671 1.0969 1.0982 1.1151 1.0654
irintensity: 0.1613 0.3157 0.0090 0.2398 0.1740 1.1619 0.4912 1.5352 0.2802 1.5641 2.7900 0.3001 0.2235 3.0706 0.1237 0.6547 3.4891 22.8089 5.3476 4.3359 11.7699 152.3050 3.0691 2.6749 0.5131 13.4721 15.8099 3.3265 22.0166 10.3128 8.8674 7.8855 2.7671 6.6010 3.5188 2.1683 6.8067 75.0905 9.8067 3.4552 149.3571 35.9031 38.3496 28.6864 29.5213 15.6487 32.4829 10.2926 9.2164 9.7178 5.8143 10.5441 203.6050 43.1087 2.4125 12.9026 12.2448 0.1512 17.9561 9.3427 0.3618 3.3340 0.8301 1.3845 72.7955 29.8632 4.9168 9.3126 4.3774 8.8976 23.9599 5.2728 15.6704 10.2780 30.8171 25.2663 2.7497 10.3372 2.7606 12.9301 4.2355 12.0626 23.1370 122.3789 0.6384 0.9392 19.3550 20.2394 56.0808 21.5485 36.9799 24.2484 8.9577 5.4641 37.7600 21.1977 6.5617 65.5905 50.5762 48.3960 15.9109 54.6487 5.0105 3.6528 6.9301 11.6755 19.3433 2.9665
temp: 298.150 k
press: 1.00000 atm
elementType: 8 8 8 6 6 6 6 6 6 6 6 6 6 6 6 6 1 1 1 1 1 1 1 1 1 1 1 1 1 1 1 1 1 1 1 1 1 1
symmnumber: 1
zpe: 850651.8 jmol-1
zpe.correction: 0.323996 hartree
zpe.thermalcorrener: 0.343840 hartree
zpe.thermalcorrenthalpy: 0.344785 hartree
zpe.thermalcorrgfe: 0.272722 hartree
zpe.sumelectzpe: -732.926583 hartree
zpe.sumelectthermal: -732.906739 hartree
zpe.sumelectthermalent: -732.905795 hartree
zpe.sumelectthermalfe: -732.977858 hartree
dipole: 0.1742 -1.8980 -0.3634
dipole: 1.9403
quadrupole: -86.9149 -99.6203 -100.1779
quadrupole: 3.1731 4.0064 1.0853
quadrupole: 8.6561 -4.0492 -4.6069 3.1731 4.0064 1.0853
hfenergy: -733.2505795 hartree
pointgroup: C01 [X(C13H22O3)]
dipole: 0.0870022 0.2074757 -0.729451 debye
polarizability: 178.6798917|17.7466351|129.1827881|8.8595133|8.0497381|147.5304945 unknown
InChI: InChI=1S/C13H22O3/c1-4-7-8-11(6-3)12(14)10-13(15)16-9-5-2/h5,8,12,14H,2,4,6-7,9-10H2,1,3H3
charge 0 multiplicity 1
38 atoms
O  1.090391 -0.083799 3.081372
O  -2.943319 0.408252 0.598301
O  -1.955278 -1.708887 0.658569
C  1.407232 -0.207137 0.594995
C  0.498747 -0.506281 1.796616
C  1.088521 -0.956504 -0.697595
C  2.434476 0.683569 0.714982
C  -0.867135 0.2208 1.768824
C  3.441321 1.060452 -0.351529
C  4.904071 1.029716 0.166963
C  0.368289 -0.081243 -1.759573
C  -1.928396 -0.491034 0.950951
C  5.921208 1.487749 -0.899831
C  -4.09598 -0.152846 -0.189977
C  -3.859825 0.038507 -1.667051
C  -3.824853 -0.980757 -2.560459
H  0.302531 -1.600498 1.819489
H  0.454912 -1.834748 -0.472271
H  2.025151 -1.346404 -1.142627
H  -0.761399 1.263831 1.429217
H  -1.229595 0.258371 2.81538
H  2.553439 1.205642 1.677578
H  3.226005 2.090265 -0.712346
H  3.351347 0.40086 -1.235875
H  4.984483 1.67942 1.062088
H  5.147617 0.00237 0.503063
H  -0.592184 0.309902 -1.380119
H  0.992658 0.782301 -2.051399
H  0.149721 -0.673853 -2.667117
H  2.01127 -0.448342 3.128626
H  6.956223 1.45233 -0.513359
H  5.873524 0.842271 -1.797213
H  5.715971 2.525946 -1.223261
H  -4.2235 -1.218125 0.066723
H  -4.954545 0.439508 0.169141
H  -3.725033 1.076441 -2.002101
H  -3.674796 -0.799023 -3.630599
H  -3.939669 -2.024425 -2.24428
