program: Gaussian 09
title: 000252445
version: EM64L-G09RevD.01
frameworkgroup: C1[X(C10H17N)]
method: RPBEPBE
basis: SDD
operation: Freq
keyword: #pfreq=noraman
keyword: PBEPBE/SDD
title: #p freq=noraman PBEPBE/SDD
converged: YES YES NO NO
title: Mulliken charges:
elementType: N C C C C C C C C C C H H H H H H H H H H H H H H H H H
charge: -0.604900 0.343536 -0.301067 -0.264530 -0.546996 0.256953 -0.205426 -0.765079 -0.780251 -0.284274 -0.747582 0.254976 0.237896 0.238639 0.221149 0.221702 0.210282 0.216101 0.227414 0.209860 0.230029 0.212146 0.218441 0.232412 0.199023 0.229195 0.258595 0.281758
chargesum: 0.00000
title: Mulliken charges with hydrogens summed into heavy atoms:
elementType: N C C C C C C C C C C
charge: -0.064547 0.343536 -0.046091 -0.026635 -0.087209 0.256953 0.016276 -0.111282 -0.128216 -0.065833 -0.086952
polarizability: 1.23118423e+02 3.70828958e+00 1.02790344e+02 -2.16137961e+00 -2.28933163e+00 9.89016039e+01
1716.lowfreq: -23.9336 -22.4986 -0.0005 -0.0001 -0.0001 6.4546 141.1453 155.3794 182.4560
frequency: 141.0701 155.2601 182.4516 193.8200 218.8918 246.8976 277.5120 289.3718 310.1188 359.3838 375.3414 384.6708 424.0010 445.8684 461.9966 518.9704 559.9055 616.9179 627.9112 660.7312 728.3734 745.6473 825.6028 853.7121 889.1593 894.7290 921.2971 933.7210 943.8459 950.8008 955.1243 990.5486 1000.5182 1013.2545 1037.5247 1063.5730 1097.6180 1132.8268 1141.5481 1160.7943 1187.0712 1205.7486 1222.2263 1230.9499 1247.5921 1251.9012 1285.7743 1304.9303 1354.5816 1367.4360 1376.9263 1390.1153 1457.6133 1465.8688 1470.1868 1470.7789 1475.7365 1491.2412 1499.8713 1617.2773 1632.0336 2964.3738 2971.4856 2975.1342 3032.3896 3039.6259 3045.7859 3050.5335 3056.3810 3065.0349 3078.0815 3082.0453 3092.3230 3103.1659 3109.0437 3131.1344 3444.0923 3579.1301
redmass: 1.9810 1.0889 2.5525 2.6744 1.1059 1.4195 1.1820 2.1085 1.9450 3.1064 2.5097 2.4573 2.2623 2.2688 3.0163 3.1045 2.9445 2.5775 1.7998 3.4254 2.0363 1.9511 2.2977 2.3113 1.8429 2.7072 2.0181 1.6244 1.5714 1.4980 1.8031 1.4948 1.4308 1.6197 2.5036 1.2100 1.5451 1.5753 1.2804 2.6361 1.9528 2.0672 1.7008 2.0054 2.4913 1.5337 1.7877 2.1824 1.6129 1.2301 1.2391 1.1986 1.0679 1.0566 1.0523 1.0531 1.0641 1.0731 1.0502 6.0601 1.1162 1.0366 1.0369 1.0378 1.0686 1.0861 1.0982 1.0833 1.0978 1.0966 1.0987 1.0976 1.0857 1.1003 1.1040 1.1008 1.0456 1.0954
irintensity: 3.6660 0.5705 0.5178 2.7713 1.6363 28.3643 10.6091 11.4356 1.9168 1.3929 2.4266 6.2578 1.9424 0.6195 9.9058 0.3444 1.7111 61.6172 145.9008 2.5743 28.1179 17.9180 2.2275 6.2383 0.9107 3.2145 3.1798 3.6004 3.6698 2.5459 1.0697 1.3169 0.2180 4.0232 5.3816 0.6972 4.9810 5.6633 4.4213 16.3668 6.4595 2.1194 6.3980 6.5359 20.2377 2.7283 1.6623 15.2903 18.1421 17.7428 14.2689 15.9760 3.4155 2.4868 3.8117 7.5364 6.1961 17.0110 13.2929 6.0757 43.7445 30.1560 61.7638 28.8774 16.5244 52.7491 9.3598 35.3146 62.8680 32.7317 29.3410 42.0166 13.5514 32.7034 39.9545 39.4766 2.4697 1.5915
temp: 298.150 k
press: 1.00000 atm
elementType: 7 6 6 6 6 6 6 6 6 6 6 1 1 1 1 1 1 1 1 1 1 1 1 1 1 1 1 1
symmnumber: 1
zpe: 649314.6 jmol-1
zpe.correction: 0.247311 hartree
zpe.thermalcorrener: 0.258672 hartree
zpe.thermalcorrenthalpy: 0.259616 hartree
zpe.thermalcorrgfe: 0.212335 hartree
zpe.sumelectzpe: -445.087049 hartree
zpe.sumelectthermal: -445.075688 hartree
zpe.sumelectthermalent: -445.074744 hartree
zpe.sumelectthermalfe: -445.122024 hartree
dipole: 0.0104 0.0522 0.8593
dipole: 0.8609
quadrupole: -65.1346 -69.2962 -69.3769
quadrupole: 1.3573 1.8043 2.5675
quadrupole: 2.8013 -1.3603 -1.4410 1.3573 1.8043 2.5675
hfenergy: -445.3343596 hartree
pointgroup: C01 [X(C10H17N1)]
dipole: 0.0113479 0.0789916 -0.3291717 debye
polarizability: 123.2573271|-3.6061071|103.5187827|1.7369086|-0.8919206|98.0342608 unknown
InChI: InChI=1S/C10H17N/c1-9(2)7-4-5-10(3,11)8(9)6-7/h4-5,7-8H,6,11H2,1-3H3
charge 0 multiplicity 1
28 atoms
N  1.627608 -1.688237 -0.197975
C  -1.316887 -0.362063 -0.004933
C  -0.029632 -0.19667 0.929752
C  -1.088977 1.181392 -0.339439
C  -0.448246 1.313455 1.093067
C  1.328217 -0.269085 0.158321
C  0.058056 1.312754 -1.336336
C  -2.588415 -0.603587 0.846593
C  -1.353631 -1.359421 -1.179568
C  1.217054 0.642511 -1.079117
C  2.49395 0.189247 1.07103
H  0.016902 -0.838412 1.826223
H  -1.970113 1.791956 -0.597532
H  0.357341 2.057791 1.187703
H  -1.185058 1.471615 1.896386
H  -0.062295 1.93863 -2.229475
H  -3.497657 -0.44456 0.235367
H  -2.607686 -1.649484 1.208651
H  -2.657851 0.054009 1.729463
H  -2.322794 -1.275735 -1.70895
H  -0.560417 -1.17201 -1.922413
H  -1.271127 -2.401618 -0.814578
H  2.089987 0.70494 -1.744195
H  2.569727 -0.488035 1.940918
H  3.455333 0.155614 0.521473
H  2.349762 1.221534 1.428108
H  2.604558 -1.833021 -0.479102
H  0.976389 -2.094511 -0.876145
