program: Gaussian 09
title: 000252420
version: EM64L-G09RevD.01
frameworkgroup: C1[X(C14H15N5O2)]
method: RPBEPBE
basis: SDD
operation: Freq
keyword: #p
keyword: freq=noraman
keyword: PBEPBE/SDD
title: #p freq=noraman PBEPBE/SDD
converged: YES YES NO NO
title: Mulliken charges:
elementType: O O N N N N N C C C C C C C C C C C C C C H H H H H H H H H H H H H H H
charge: -0.277220 -0.277694 -0.160125 -0.432147 -0.220676 -0.075937 -0.211871 0.113405 0.055290 0.160836 -0.482010 -0.506866 0.119524 0.201430 -0.618452 0.301042 -0.602227 -0.354890 -0.166163 -0.309415 -0.170701 0.232960 0.255041 0.439306 0.241763 0.226653 0.243230 0.269465 0.243739 0.265942 0.246737 0.247143 0.244042 0.247845 0.268654 0.242347
chargesum: 0.00000
title: Mulliken charges with hydrogens summed into heavy atoms:
elementType: O O N N N N N C C C C C C C C C C C C C C
charge: -0.277220 -0.277694 -0.160125 0.007159 -0.220676 -0.075937 -0.211871 0.113405 0.055290 0.160836 0.005990 -0.038450 0.119524 0.201430 0.137982 0.301042 0.157596 -0.110847 0.081683 -0.040761 0.071646
polarizability: 2.70731795e+02 2.75366267e+00 2.11119413e+02 3.90125638e+00 -4.90099626e+00 9.54921512e+01
1716.lowfreq: -8.3514 -4.3010 -0.0005 0.0004 0.0005 3.2946 20.7760 49.8442 62.3094
frequency: 20.7289 49.8380 62.3046 69.9288 87.2147 105.6675 115.8326 123.0009 137.4751 153.1694 187.0431 202.6023 244.5709 269.8698 301.6974 312.1562 341.4164 353.4823 371.6124 391.4004 404.8909 413.0156 451.9474 480.7605 511.6367 516.8882 569.8583 628.5283 648.7460 663.9816 684.7525 699.8142 707.3904 745.8490 753.0890 762.8631 768.4988 783.2164 895.8875 902.7575 924.5536 943.3214 964.5758 967.9292 989.2833 1000.6180 1006.9079 1031.1242 1042.9742 1046.0877 1094.9306 1103.0051 1130.0835 1131.7697 1139.3285 1168.1568 1171.0562 1193.6754 1205.6179 1227.2721 1233.4000 1259.9079 1277.9671 1297.6320 1306.0579 1309.6101 1334.7617 1352.0657 1389.7099 1394.5352 1415.4503 1424.6271 1425.8644 1454.9652 1456.3602 1465.4215 1468.6929 1474.2472 1478.2423 1479.1963 1488.9787 1547.6547 1568.4648 1574.5801 1591.3794 1607.4045 1657.7188 2785.0937 2982.8326 2992.7457 3004.3822 3009.4668 3056.7764 3068.7702 3091.9584 3100.3340 3134.6644 3136.4342 3141.4200 3147.9834 3161.3743 3180.1077
redmass: 5.3782 4.3044 5.1799 4.7719 1.0579 4.5648 2.2346 1.3906 4.5466 4.2740 4.4192 5.9295 4.6985 2.7224 3.1322 4.7754 3.6263 4.6693 6.5600 6.9080 3.8162 3.9170 3.7600 6.9248 4.6592 5.6290 3.0747 6.1049 7.1662 6.6851 7.3696 5.8786 7.3526 11.3586 2.8379 2.1956 4.5647 2.0694 2.1240 1.3633 4.1905 2.6223 3.1772 1.5868 4.1672 4.9875 1.3614 3.1913 3.1055 2.3757 1.6779 3.5014 1.3001 1.3023 1.0744 1.1962 1.0797 2.7960 1.4212 2.7087 2.1617 6.2619 3.2956 1.6635 1.9824 2.6167 2.7759 1.7691 2.7927 2.8947 1.3910 1.4626 1.7035 1.6054 1.1307 2.1598 1.3700 1.0450 1.0438 1.0798 1.5082 3.0395 6.1958 5.1530 5.5598 10.3222 9.7861 1.1080 1.0680 1.0617 1.0336 1.0327 1.0996 1.0931 1.1023 1.1020 1.1023 1.1010 1.0873 1.0912 1.0957 1.1014
irintensity: 0.6924 0.2063 1.0335 0.0998 0.0129 0.0730 6.3970 2.0900 2.7469 0.9665 5.6333 12.3734 3.2315 4.3423 0.3333 1.7732 3.2546 23.6880 4.3208 18.5809 6.7466 6.3149 4.3426 32.3159 29.6863 3.7076 6.4380 0.3250 5.1404 12.6282 7.3726 15.5423 7.3055 14.9894 14.6575 28.9481 6.0305 36.8224 13.8698 1.3958 13.1743 0.7082 68.2889 6.4566 3.2608 38.8466 0.5033 2.8209 25.1630 7.5977 22.3080 7.2493 0.2444 0.0585 51.3544 8.9910 5.2358 84.2902 10.3161 5.5180 3.1328 35.0218 52.2981 60.8400 6.8631 3.7824 81.9252 41.3606 105.7196 6.8862 28.5565 41.7087 83.3915 57.0308 29.7777 72.9917 42.1070 18.2028 14.5670 6.3284 274.9460 69.9516 12.2249 40.3300 40.4195 656.8134 400.7833 2208.0575 19.1022 19.4616 39.5876 32.9410 23.5832 12.8788 20.2791 19.9834 0.8968 0.7434 4.2050 2.2034 15.4511 12.0754
temp: 298.150 k
press: 1.00000 atm
elementType: 8 8 7 7 7 7 7 6 6 6 6 6 6 6 6 6 6 6 6 6 6 1 1 1 1 1 1 1 1 1 1 1 1 1 1 1
symmnumber: 1
zpe: 736342.7 jmol-1
zpe.correction: 0.280458 hartree
zpe.thermalcorrener: 0.298902 hartree
zpe.thermalcorrenthalpy: 0.299846 hartree
zpe.thermalcorrgfe: 0.232665 hartree
zpe.sumelectzpe: -965.245521 hartree
zpe.sumelectthermal: -965.227077 hartree
zpe.sumelectthermalent: -965.226133 hartree
zpe.sumelectthermalfe: -965.293314 hartree
dipole: -8.9986 -1.7473 -0.1447
dipole: 9.1678
quadrupole: -104.8842 -119.6420 -122.7383
quadrupole: -1.5539 0.8048 -3.5077
quadrupole: 10.8706 -3.8872 -6.9835 -1.5539 0.8048 -3.5077
hfenergy: -965.5259789 hartree
pointgroup: C01 [X(C14H15N5O2)]
dipole: 3.5646793 -0.5143476 -0.1952588 debye
polarizability: 265.0662256|-24.1232379|100.8483824|-13.9429908|-14.03949|211.4287513 unknown
InChI: InChI=1S/C14H15N5O2/c1-18-12-11(13(20)19(2)14(18)21)16-10(17-12)7-6-9-5-3-4-8-15-9/h3-5,8,16H,6-7H2,1-2H3
charge 0 multiplicity 1
36 atoms
O  -1.729891 0.406215 -2.263418
O  -4.986856 0.826277 1.128935
N  -2.76453 0.497354 1.810209
N  0.306838 0.069893 0.072473
N  -3.346057 0.610917 -0.532865
N  -0.348833 0.141997 2.258775
N  2.58393 -0.244058 -1.307626
C  -1.072252 0.268624 0.065347
C  -1.444077 0.311682 1.42236
C  0.703455 -0.000339 1.390356
C  2.138615 -0.183694 1.803469
C  2.950271 -1.215177 0.957312
C  -1.999975 0.420807 -1.021874
C  -3.769299 0.654089 0.826969
C  -3.127193 0.53208 3.238805
C  3.479434 -0.740473 -0.392127
C  -4.422282 0.783659 -1.534204
C  4.854898 -0.846669 -0.720223
C  5.30351 -0.446444 -1.998643
C  3.016254 0.143041 -2.540107
C  4.369184 0.055936 -2.932007
H  2.664097 0.792355 1.795796
H  2.121834 -0.520998 2.854373
H  1.021488 -0.027856 -0.714985
H  2.317261 -2.110472 0.796559
H  3.815465 -1.545258 1.559668
H  -2.844882 -0.417504 3.724046
H  -4.214477 0.68412 3.302571
H  -2.595299 1.355515 3.744664
H  -3.953933 0.723485 -2.527705
H  -4.916302 1.759613 -1.396922
H  -5.182251 -0.005941 -1.414856
H  5.558908 -1.240887 0.019348
H  6.363614 -0.525483 -2.261382
H  2.247675 0.527603 -3.218778
H  4.674258 0.373693 -3.933017
