program: Gaussian 09
title: 000252387
version: EM64L-G09RevD.01
frameworkgroup: C1[X(C8H13IO4)]
method: RPBEPBE
basis: SDD
operation: Freq
keyword: #p
keyword: freq=noraman
keyword: PBEPBE/SDD
title: #p freq=noraman PBEPBE/SDD
converged: YES YES NO NO
title: Mulliken charges:
elementType: I O O O O C C C C C C C C H H H H H H H H H H H H H
charge: 0.052738 -0.285731 -0.243046 -0.232912 -0.444252 -0.163444 -0.098313 -0.135570 0.070882 0.333442 -0.832710 -0.669394 -0.690872 0.265016 0.254982 0.238675 0.254850 0.306019 0.285930 0.230952 0.218656 0.240981 0.243353 0.220333 0.225087 0.354349
chargesum: 0.00000
title: Mulliken charges with hydrogens summed into heavy atoms:
elementType: I O O O O C C C C C C C C
charge: 0.052738 -0.285731 -0.243046 -0.232912 -0.089903 0.101572 0.156669 0.103104 0.325732 0.333442 -0.240761 0.021195 -0.002099
polarizability: 1.58371340e+02 5.84759309e+00 1.03908998e+02 1.06348308e+01 1.93281157e+00 9.10017090e+01
1716.lowfreq: -6.3265 0.0003 0.0006 0.0007 0.4380 9.5784 31.4826 55.4966 66.4136
frequency: 31.4376 55.4635 66.3891 111.5672 135.2110 151.1676 162.6507 201.4358 219.9196 287.7087 310.4340 327.5228 337.7699 374.7352 394.6659 407.4087 500.6427 518.4396 527.5327 573.8365 600.9233 641.3148 712.4941 726.9521 779.7141 821.4640 847.8613 922.6858 926.3309 938.2686 952.9197 987.2965 992.1242 996.3967 1014.4218 1039.0529 1056.1659 1114.3306 1137.9568 1153.5834 1186.4585 1204.2543 1211.7970 1220.8717 1244.8072 1253.4024 1267.1468 1281.6397 1299.4044 1313.2817 1354.4329 1379.5497 1390.4996 1393.3152 1418.5366 1446.7952 1454.6373 1466.4295 1478.4439 2980.5795 2998.3042 3000.4011 3008.7821 3048.9900 3058.0936 3064.4486 3099.5891 3111.0112 3113.6127 3122.8146 3147.6744 3577.4941
redmass: 5.7069 5.4632 4.2138 5.3763 3.6539 1.0802 4.5323 2.2630 1.2500 4.0761 3.0485 1.2126 3.2441 2.9549 3.0257 4.2512 4.6435 4.1151 4.5133 6.2217 4.7891 4.7353 4.1036 6.8655 2.1822 4.2011 3.6342 1.5903 3.9096 2.1771 2.2469 1.3232 3.2524 5.3560 5.7377 5.0353 3.8952 1.9802 1.8535 1.3212 1.2707 2.5616 1.4642 1.3223 1.3103 1.2658 2.8788 1.2625 1.2896 1.2155 1.3714 1.2793 1.4204 1.2536 1.1261 1.0520 1.0485 1.0554 1.0544 1.0839 1.0755 1.0445 1.0357 1.0869 1.0563 1.0891 1.1000 1.0994 1.1003 1.1009 1.1098 1.0665
irintensity: 0.1715 0.1127 1.7509 0.9704 2.8020 0.0067 0.9583 0.8446 2.1420 9.8658 2.2085 135.9422 23.4347 9.6882 2.1922 4.6246 16.3959 4.8333 1.9943 20.5037 11.8985 7.1445 30.7364 15.0591 5.6469 20.2396 41.6183 7.2746 177.8585 24.9619 73.8176 0.4688 43.0825 146.5834 18.1612 99.2237 24.6012 10.0309 38.9789 13.7057 15.3872 85.9222 19.7151 54.1584 3.2167 6.7323 55.5434 6.5063 4.8773 9.0474 0.4611 36.8002 19.3608 22.0304 13.8795 1.4151 3.9985 6.7104 11.3436 8.3856 19.5677 28.8666 12.8770 7.7956 9.0899 48.5719 4.7538 23.0029 18.7000 18.8964 2.6462 15.1471
temp: 298.150 k
press: 1.00000 atm
elementType: 53 8 8 8 8 6 6 6 6 6 6 6 6 1 1 1 1 1 1 1 1 1 1 1 1 1
symmnumber: 1
zpe: 536260.1 jmol-1
zpe.correction: 0.204251 hartree
zpe.thermalcorrener: 0.218084 hartree
zpe.thermalcorrenthalpy: 0.219028 hartree
zpe.thermalcorrgfe: 0.161763 hartree
zpe.sumelectzpe: -623.987567 hartree
zpe.sumelectthermal: -623.973734 hartree
zpe.sumelectthermalent: -623.972790 hartree
zpe.sumelectthermalfe: -624.030055 hartree
dipole: 3.0512 2.1802 1.7771
dipole: 4.1498
quadrupole: -93.0207 -91.9325 -87.4176
quadrupole: 0.9077 2.4755 -0.9035
quadrupole: -2.2304 -1.1422 3.3727 0.9077 2.4755 -0.9035
hfenergy: -624.1918175 hartree
pointgroup: C01 [X(C8H13I1O4)]
dipole: -0.7641487 -0.8290324 1.1808079 debye
dipolederiv: -0.2592152 -0.1545491 0.0851791 -0.1635657 -0.2156175 0.0575767 0.1560607 0.1242865 -0.1608339 -0.9653817 0.2105032 -0.0148052 0.3233429 -0.6176117 -0.0142421 0.126789 -0.0079299 -0.4519147 -1.1437623 -0.1342248 -0.0808545 -0.2514935 -0.4177425 -0.0427119 -0.2459884 -0.0078124 -0.4778851 -1.0973769 -0.0007174 0.2135983 0.2814833 -0.4715235 -0.0669277 0.2271549 -0.0473703 -0.6155033 -0.4967513 0.192427 -0.3087039 0.1950567 -0.7203508 0.1117869 -0.2825415 0.0508773 -0.4146194 0.5303519 -0.0462527 -0.1040943 -0.1688573 0.1113182 0.1249758 -0.1955475 0.2875571 0.0357854 1.3481507 0.1205557 -0.1060452 0.185904 0.5185861 0.1893937 0.1547298 0.1067049 0.4585241 0.1425142 -0.3330421 0.2171484 -0.2200602 0.4849833 -0.1062925 -0.041862 -0.2517327 0.3801432 0.5802371 -0.072826 0.1085758 -0.2710525 0.1609123 0.0121352 0.4149723 0.2358522 0.1763668 1.055948 -0.1012356 -0.091885 -0.3000897 0.8166748 0.10925 -0.2199725 0.0697542 0.7036461 0.3425133 0.3056698 -0.2791498 0.2955152 0.2809278 -0.2309264 -0.3765271 -0.2683185 0.2227917 -0.075419 -0.0995343 -0.0613839 0.0003234 -0.2049724 -0.1300497 -0.002829 -0.1179615 -0.0620189 -0.2499999 -0.0312129 -0.0015716 -0.049214 -0.0035141 -0.0254439 -0.0268926 -0.0330351 0.0314867 -0.0186961 0.0227683 0.0228002 0.0259199 -0.1016658 -0.0418362 0.0031954 -0.0656982 0.0722714 -0.0370663 -0.0040983 0.0393734 -0.044804 -0.0046518 -0.0844014 0.005487 -0.0911382 -0.082303 0.0231758 0.0783204 0.0113944 0.0651617 -0.0517169 -0.0687874 0.0237633 -0.0830802 -0.0543757 -0.0382098 0.0558886 0.0125198 0.1199631 -0.0283004 -0.0387214 0.0091447 -0.0920517 -0.0132794 -0.0121794 -0.0479357 0.0214969 -0.0062232 0.0302435 0.1027777 -0.0110828 0.0824253 -0.0208786 -0.0243062 0.0310271 0.1301044 -0.0457498 -0.0035267 0.0092661 0.1307119 -0.0029541 -0.0141099 0.0303464 0.1034846 -0.0339285 0.0993708 -0.0390817 0.0295169 -0.0558043 0.0636356 0.0653506 0.0783932 -0.0051883 0.0655404 -0.01291 0.0739903 0.035655 0.0873492 -0.0049973 -0.1101451 -0.1075119 -0.0525433 -0.0269079 -0.0595091 0.0836845 -0.0015394 -0.0270343 -0.0049556 0.0878436 0.0835437 -0.0162352 -0.0081571 -0.0537607 -0.044373 -0.097532 -0.0343771 -0.1006936 0.0475211 0.0495157 -0.000413 0.0384698 -0.0205058 0.1087553 0.0104473 0.0986919 0.0204641 -0.0941601 0.0275781 0.0492176 -0.0187548 0.0936431 -0.0389915 0.076276 -0.0583343 0.0688145 0.0769759 0.233608 -0.0698536 0.170041 -0.0178885 0.2935641 0.0803547 0.1407434 0.0693576 0.2133202 unknown
polarizability: 145.586669|17.6387708|107.1274644|-18.3225825|-13.8305475|100.5679135 unknown
InChI: InChI=1S/C8H13IO4/c1-8(2)12-6-5(10)4(3-9)11-7(6)13-8/h4-7,10H,3H2,1-2H3
charge 0 multiplicity 1
26 atoms
I  3.944351 2.1177 -1.036952
O  -1.527631 -1.074541 0.729436
O  0.697611 0.678786 -1.027498
O  -1.676328 0.231648 -1.223314
O  1.875511 -1.986919 1.131755
C  -0.282261 -1.302226 -0.015104
C  -0.363766 -0.341025 -1.248699
C  0.996569 -0.882653 0.763417
C  1.763166 0.002989 -0.257265
C  -2.204104 0.138459 0.171614
C  2.660886 1.032681 0.40333
C  -1.841275 1.395469 0.974536
C  -3.698715 -0.145321 0.090378
H  -0.237913 -2.369292 -0.29219
H  -0.223906 -0.799631 -2.241338
H  0.684902 -0.291483 1.648903
H  2.351968 -0.671639 -0.913126
H  3.364476 0.542666 1.092631
H  2.079733 1.816621 0.912407
H  -2.370647 2.268269 0.555465
H  -2.143769 1.268136 2.028491
H  -0.759841 1.598655 0.918191
H  -3.874852 -1.058843 -0.498952
H  -4.111012 -0.285515 1.103981
H  -4.218813 0.700162 -0.390586
H  1.47976 -2.489852 1.886788
