program: Gaussian 09
title: 000252381
version: EM64L-G09RevD.01
frameworkgroup: C1[X(C17H16O2)]
method: RPBEPBE
basis: SDD
operation: Freq
keyword: #pfreq=noraman
keyword: PBEPBE/SDD
title: #p freq=noraman PBEPBE/SDD
converged: YES YES NO NO
title: Mulliken charges:
elementType: O O C C C C C C C C C C C C C C C C C H H H H H H H H H H H H H H H H
charge: -0.266829 -0.432251 -0.600124 -0.558998 0.387345 0.329933 0.349574 -0.547268 0.330884 -0.575878 -0.432368 0.332418 -0.390783 -0.360645 -0.365379 -0.371013 -0.409755 0.283231 -0.536781 0.225754 0.227845 0.222607 0.222006 0.229801 0.258790 0.232364 0.239701 0.233058 0.237964 0.248757 0.217267 0.243952 0.220493 0.220911 0.353414
chargesum: 0.00000
title: Mulliken charges with hydrogens summed into heavy atoms:
elementType: O O C C C C C C C C C C C C C C C C C
charge: -0.266829 -0.078837 -0.146525 -0.114385 0.387345 0.329933 0.349574 -0.317467 0.330884 -0.317088 -0.200004 0.332418 -0.151081 -0.127587 -0.127415 -0.122256 -0.192488 0.283231 0.148575
polarizability: 4.17883762e+02 1.28087922e+01 1.73836322e+02 -1.96789347e+00 -6.81942418e+00 9.73125340e+01
1716.lowfreq: -2.0832 0.0005 0.0008 0.0010 3.0362 8.9106 32.0060 49.2090 63.9818
frequency: 31.9944 49.1582 63.9791 87.6567 121.2713 151.0883 163.1030 204.3916 216.6680 228.5596 251.9642 291.8828 313.5428 357.3999 365.5668 388.8719 406.6335 411.9785 427.6727 458.7161 461.6867 505.6921 522.3895 548.3640 565.6340 586.9562 614.5192 635.2495 706.9004 720.0814 731.6052 758.2834 781.4267 799.6716 807.6213 809.1330 833.5287 880.5240 890.8067 892.4623 925.8263 936.1799 939.2951 948.2828 961.3554 999.5396 1004.0207 1032.0997 1043.8258 1107.1435 1113.1296 1127.5858 1142.1336 1145.1052 1164.1244 1180.4274 1185.9447 1204.3550 1222.6629 1239.5256 1252.5009 1272.3131 1292.1705 1305.0420 1316.8390 1329.1452 1359.9951 1382.0482 1392.0143 1431.0107 1432.5542 1445.9570 1450.5104 1461.8641 1465.8332 1474.4827 1492.7386 1506.3081 1564.6997 1584.6606 1616.0531 1622.7205 1627.4781 2946.2124 2956.8064 2958.3001 3038.1445 3039.9484 3045.7958 3111.9058 3112.6061 3121.0368 3123.6005 3140.9515 3145.7450 3151.5107 3164.3258 3170.3873 3580.6812
redmass: 5.4699 3.5445 5.0720 3.7606 4.6864 3.2393 3.0633 2.9742 5.8934 1.6245 2.1147 3.5694 4.2413 1.1201 4.5263 4.3007 3.4385 3.1533 3.0384 3.2895 3.9531 3.5925 5.0597 2.8557 3.3929 3.7703 4.3714 6.9707 5.0163 3.5631 3.1895 2.9525 3.6015 1.3593 3.8457 1.6140 1.5718 2.9294 1.5917 1.5725 1.4240 2.7683 1.4483 2.9194 1.4303 3.2372 3.4358 1.9702 2.4177 1.4602 1.2595 1.7379 1.4909 1.3622 1.1883 1.4079 1.1512 1.4881 1.8660 2.2991 2.4189 1.6513 2.1699 1.4732 1.7779 1.5607 1.8185 6.0493 3.9766 2.8466 1.6208 2.1920 1.1106 1.1119 1.0500 1.0971 2.7518 2.7554 7.1099 6.0597 6.4374 6.7914 6.6082 1.0689 1.0638 1.0329 1.0905 1.0970 1.1039 1.0890 1.0903 1.0898 1.0987 1.0879 1.0918 1.0938 1.0936 1.0962 1.0660
irintensity: 0.4599 1.6010 0.3145 3.7786 3.1902 0.5637 1.2484 1.7091 0.2241 1.4563 0.7138 3.7884 8.8692 144.3631 12.2148 0.0538 1.6274 1.0616 4.0574 1.9920 9.1881 15.7855 38.1153 14.2963 7.6824 3.8025 0.8765 1.1300 6.9945 0.9261 8.4708 9.1647 9.1682 13.4563 24.9751 29.5204 61.1788 3.4784 36.2046 9.3287 0.8722 1.3630 5.2289 2.4925 0.7153 27.0120 45.1155 10.8541 4.4142 100.1746 0.2085 76.4095 72.3718 211.8006 4.2002 57.8854 2.5940 8.3738 23.5492 179.0772 8.5513 72.6089 26.7749 4.3973 2.0500 16.5132 39.6094 1.9470 21.7361 11.4798 31.9624 38.5310 11.7617 2.6023 13.2570 42.2007 20.7751 208.0549 48.1798 29.9145 3.0825 52.5117 99.1350 26.6546 37.7457 102.3130 37.5365 28.1231 50.4226 29.8633 21.2327 35.9432 15.5323 8.1045 7.3106 14.2402 23.3897 9.2031 70.1886
temp: 298.150 k
press: 1.00000 atm
elementType: 8 8 6 6 6 6 6 6 6 6 6 6 6 6 6 6 6 6 6 1 1 1 1 1 1 1 1 1 1 1 1 1 1 1 1
symmnumber: 1
zpe: 739017.6 jmol-1
zpe.correction: 0.281477 hartree
zpe.thermalcorrener: 0.297839 hartree
zpe.thermalcorrenthalpy: 0.298783 hartree
zpe.thermalcorrgfe: 0.237422 hartree
zpe.sumelectzpe: -806.499475 hartree
zpe.sumelectthermal: -806.483113 hartree
zpe.sumelectthermalent: -806.482168 hartree
zpe.sumelectthermalfe: -806.543530 hartree
dipole: -0.6842 0.5114 -0.9304
dipole: 1.2630
quadrupole: -90.3734 -101.4322 -115.5026
quadrupole: 20.0845 -3.3170 -1.7757
quadrupole: 12.0627 1.0039 -13.0666 20.0845 -3.3170 -1.7757
hfenergy: -806.7809516 hartree
pointgroup: C01 [X(C17H16O2)]
dipole: 0.2707111 0.1904082 0.3706526 debye
polarizability: 417.6099092|-15.1983748|173.777584|-1.8376914|8.5008365|97.6451246 unknown
InChI: InChI=1S/C17H16O2/c1-19-17-9-6-14-10-13(2-3-15(14)11-17)12-4-7-16(18)8-5-12/h4-11,18H,2-3H2,1H3
charge 0 multiplicity 1
35 atoms
O  5.6235 0.28323 0.058278
O  -6.573173 -0.597657 0.068148
C  1.004343 1.924396 -0.587287
C  -0.352132 1.748806 0.134181
C  1.9874 0.813834 -0.250472
C  -0.901159 0.326774 -0.014744
C  1.455235 -0.502007 -0.048232
C  0.005176 -0.709076 -0.076294
C  -2.366398 0.10744 -0.000543
C  3.37352 1.024805 -0.205932
C  2.357599 -1.572777 0.173167
C  4.260768 -0.058192 0.031496
C  3.75398 -1.367934 0.217223
C  -2.957373 -1.077522 -0.53786
C  -3.250007 1.07587 0.556472
C  -4.344311 -1.295935 -0.504818
C  -4.644641 0.870574 0.599253
C  -5.193623 -0.32048 0.069481
C  6.584916 -0.793961 0.300947
H  1.436274 2.914621 -0.352755
H  0.822439 1.906004 -1.683362
H  -1.069493 2.487003 -0.268959
H  -0.229683 1.977791 1.215194
H  -0.347282 -1.748548 -0.082145
H  3.799749 2.022016 -0.35972
H  1.960495 -2.58427 0.32383
H  4.422216 -2.215402 0.395664
H  -2.319841 -1.828586 -1.016444
H  -2.845376 1.997513 0.987231
H  -4.789218 -2.201537 -0.927806
H  -5.297023 1.633139 1.04497
H  7.571879 -0.308812 0.280475
H  6.532568 -1.567039 -0.490482
H  6.420956 -1.265257 1.28978
H  -7.08048 0.14368 0.482768
