program: Gaussian 09
title: 000252369
version: EM64L-G09RevD.01
frameworkgroup: C1[X(C7H8N2O2)]
method: RPBEPBE
basis: SDD
operation: Freq
keyword: #pfreq=noraman
keyword: PBEPBE/SDD
title: #p freq=noraman PBEPBE/SDD
converged: YES YES NO NO
title: Mulliken charges:
elementType: O O N N C C C C C C C H H H H H H H H
charge: -0.330370 -0.289866 -0.052310 -0.637923 0.103130 0.108725 -0.241860 -0.194688 0.160556 -0.324384 -0.494663 0.293898 0.236722 0.244300 0.245977 0.245971 0.224721 0.374466 0.327597
chargesum: 0.00000
title: Mulliken charges with hydrogens summed into heavy atoms:
elementType: O O N N C C C C C C C
charge: -0.330370 -0.289866 -0.052310 0.064139 0.103130 0.108725 0.052038 0.042033 0.160556 -0.080084 0.222007
polarizability: 1.15894350e+02 2.16756532e+00 1.23349787e+02 -1.18637380e-02 3.53857101e-02 4.34736395e+01
1716.lowfreq: -12.3775 -10.4445 -0.0007 0.0001 0.0008 4.7649 69.7124 114.8174 119.7499
frequency: 69.7085 114.8128 119.7493 155.0142 199.9496 260.7419 264.0613 369.0165 382.4059 431.3917 516.4127 528.3626 587.6096 602.7433 611.5678 696.1379 703.7597 714.1225 775.1544 823.0684 826.7486 954.6715 966.7526 1004.4031 1038.8458 1065.7566 1095.9328 1114.1254 1140.0081 1153.0830 1225.9585 1253.8996 1334.6033 1360.8659 1397.5811 1432.8986 1441.5506 1445.9009 1468.3232 1546.7648 1571.9483 1593.9660 1624.4141 3009.6010 3117.3090 3139.9486 3142.5694 3154.3541 3180.2980 3446.5800 3644.6191
redmass: 5.3151 3.0718 3.3748 1.2605 4.0317 4.8950 4.3603 4.4933 7.0191 3.8816 5.2798 3.0369 4.8483 1.3393 5.2858 1.4275 5.2567 2.4671 3.5137 5.9678 1.5494 1.3990 8.8419 1.3560 3.8648 2.0274 2.3189 1.2487 1.4741 1.3572 2.3743 2.1966 9.1586 2.8558 1.8709 2.4525 1.4087 1.0520 1.0668 5.5211 3.1612 1.9051 4.2995 1.0283 1.1049 1.0898 1.1054 1.0914 1.0993 1.0507 1.1002
irintensity: 3.6108 0.5033 14.6657 1.1652 2.0743 0.3513 23.0863 11.6975 1.7326 1.2516 7.2934 0.2101 5.7528 142.3986 4.3959 147.6245 4.4289 0.1119 63.9668 14.9841 28.4849 0.0142 59.7956 2.1391 8.0872 26.2496 3.2846 0.1681 9.1720 3.9996 87.1082 40.3985 22.9793 165.1417 99.2156 8.2818 74.1023 13.8717 17.3101 8.3240 193.5111 28.2851 338.0951 47.5251 23.8711 17.4783 15.4639 0.9820 20.3180 83.5853 81.7685
temp: 298.150 k
press: 1.00000 atm
elementType: 8 8 7 7 6 6 6 6 6 6 6 1 1 1 1 1 1 1 1
symmnumber: 1
zpe: 381728.8 jmol-1
zpe.correction: 0.145393 hartree
zpe.thermalcorrener: 0.155328 hartree
zpe.thermalcorrenthalpy: 0.156272 hartree
zpe.thermalcorrgfe: 0.109913 hartree
zpe.sumelectzpe: -530.699489 hartree
zpe.sumelectthermal: -530.689554 hartree
zpe.sumelectthermalent: -530.688610 hartree
zpe.sumelectthermalfe: -530.734969 hartree
dipole: 3.3090 -1.9377 -0.0007
dipole: 3.8346
quadrupole: -71.0581 -47.8804 -66.2757
quadrupole: 5.0096 0.0381 -0.0154
quadrupole: -9.3201 13.8577 -4.5376 5.0096 0.0381 -0.0154
hfenergy: -530.844882 hartree
pointgroup: C01 [X(C7H8N2O2)]
dipole: 1.0526798 -1.0224046 -0.3500832 debye
dipolederiv: -0.494596 0.0005816 0.0141651 0.2001978 -1.512419 -0.3213933 0.0648437 -0.3051786 -0.4074292 -0.947609 0.2946275 0.1245324 0.137007 -0.7808788 -0.1165245 0.0828685 -0.128267 -0.4203402 -0.4592016 -0.4158716 -0.0862421 0.0360868 -0.6391563 -0.112755 0.0295008 -0.0760132 -0.2336618 -0.5562828 -0.282114 -0.0825212 -0.2186726 -0.9962193 -0.066855 -0.0666285 -0.0624372 -0.684724 -0.4575748 0.1174587 0.0688909 -0.1855028 -0.4378129 -0.0998417 -0.0081194 -0.1248804 -0.0213788 0.1911838 0.3358684 0.0833587 -0.0196221 1.4298808 0.3278443 -0.0076955 0.2993557 0.2376724 0.2111806 0.0343888 -0.0145147 0.1829136 0.1692059 0.0464364 0.0243725 0.0590784 -0.057153 -0.4180709 0.0165925 0.0256411 0.1792944 -0.022905 0.0203125 0.0671149 0.0338561 -0.1569285 1.4593124 0.0167086 -0.0992771 0.1659946 1.3091118 0.2695921 -0.0609555 0.2801122 0.3049913 0.3882006 0.1531557 0.0012725 -0.1654275 0.3395241 0.1200261 -0.0804803 0.0937398 -0.0436634 0.3904939 -0.3127143 -0.0903403 -0.1951724 0.6572273 0.1155442 -0.0600307 0.1248557 0.3054783 0.1169419 0.0821474 0.0236724 0.0458508 0.0865054 -0.0196169 0.0142363 -0.022865 0.1411188 0.0689717 -0.0522196 -0.0047334 -0.0731888 -0.0669379 -0.0557227 -0.0101998 -0.0574622 0.1598836 -0.0964444 -0.0825615 -0.0019322 -0.0436199 0.065935 -0.0147467 0.0081528 -0.0115264 0.1338413 -0.0155002 0.1279689 -0.0543993 0.0126924 0.0532193 -0.0220789 -0.0980256 0.0210629 -0.0456219 0.0122115 0.0874883 0.1011639 -0.0263746 0.0322684 0.0718208 0.0861634 0.0102842 -0.0529697 0.0387242 -0.1221273 -0.0240984 -0.040925 -0.1097294 -0.0556052 -0.0033994 -0.0489402 0.110003 0.4133819 -0.0283915 -0.0106297 -0.0112735 0.2199031 -0.0397161 -0.0059635 -0.0375809 0.3677581 0.1546771 0.0290134 0.0259913 0.0197418 0.2032776 -0.0467204 0.0242452 -0.0471937 0.3631237 unknown
polarizability: 117.0331428|5.098057|117.0479106|-4.7801263|18.5181918|48.6367235 unknown
InChI: InChI=1S/C7H8N2O2/c1-11-7-5(6(8)10)3-2-4-9-7/h2-4H,8H2,1H3
charge 0 multiplicity 1
19 atoms
O  0.141334 -1.491335 -0.40206
O  -2.852974 1.400838 0.594023
N  1.808546 0.139678 -0.120194
N  -2.44054 -0.804152 -0.01481
C  -0.545873 0.753418 0.232274
C  0.493208 -0.174534 -0.092611
C  -0.130196 2.070474 0.536047
C  1.237505 2.420111 0.512409
C  -2.033329 0.477044 0.28597
C  2.173777 1.419648 0.178438
C  1.242437 -2.425274 -0.729197
H  -0.916203 2.79075 0.786904
H  1.569801 3.43506 0.745413
H  3.248274 1.630146 0.144064
H  1.937963 -2.510208 0.12125
H  1.795923 -2.070422 -1.613507
H  0.737005 -3.381433 -0.930227
H  -1.748972 -1.520603 -0.255087
H  -3.438886 -1.005204 0.015501
