program: Gaussian 09
title: 000252361
version: EM64L-G09RevD.01
frameworkgroup: C1[X(C8H16)]
method: RPBEPBE
basis: SDD
operation: Freq
keyword: #p
keyword: freq=noraman
keyword: PBEPBE/SDD
title: #p freq=noraman PBEPBE/SDD
converged: YES YES NO NO
title: Mulliken charges:
elementType: C C C C C C C C H H H H H H H H H H H H H H H H
charge: -0.000570 -0.000568 -0.438458 -0.409634 -0.409634 -0.411813 -0.746741 -0.746742 0.192324 0.192323 0.191288 0.180258 0.194966 0.183828 0.183828 0.194966 0.194350 0.192750 0.212198 0.212200 0.207242 0.207242 0.212200 0.212198
chargesum: 0.00000
title: Mulliken charges with hydrogens summed into heavy atoms:
elementType: C C C C C C C C
charge: 0.191753 0.191755 -0.066912 -0.030840 -0.030840 -0.024713 -0.115101 -0.115101
polarizability: 9.34093414e+01 -2.11765978e-05 8.51801107e+01 -1.47748775e-06 -8.11778098e-02 7.19823921e+01
1716.lowfreq: -27.9378 -0.0008 -0.0007 -0.0003 21.3018 27.0869 142.2777 149.4239 220.7775
frequency: 142.2741 149.4224 220.7723 223.4169 238.3686 276.9184 335.6353 394.4663 407.1457 429.6181 442.9057 527.4572 761.4191 817.8608 841.8734 844.0732 871.3887 929.1520 947.4159 953.3215 985.0161 995.4956 1042.6742 1065.6257 1083.9318 1116.1887 1122.0690 1168.1174 1185.0773 1219.4013 1259.5244 1260.4099 1269.0117 1297.9257 1307.0494 1330.7123 1332.7828 1340.9567 1343.8082 1355.9400 1384.1277 1385.6608 1453.0608 1455.5503 1465.3808 1470.3687 1474.2493 1474.9707 1477.1187 1478.2288 2937.5098 2938.9001 2946.0426 2954.1572 2956.0941 2960.5559 2960.9119 2962.9016 3006.2163 3013.9664 3017.6770 3029.5796 3055.2471 3056.6321 3058.4582 3059.0833
redmass: 2.1880 2.1871 1.0233 1.0689 2.3175 1.7863 2.3347 3.2625 3.2762 1.6930 2.2523 2.0299 1.9969 2.4024 1.5192 1.3537 2.0109 1.8738 1.4021 1.5779 1.6860 1.2934 2.1031 1.2756 1.2626 3.0385 2.3389 2.3926 2.0512 1.3507 1.3020 1.3705 1.2072 1.3143 1.2454 1.3998 1.4266 1.5416 1.6531 1.6100 1.2207 1.2204 1.0877 1.0903 1.0824 1.0847 1.0472 1.0533 1.0577 1.0581 1.0720 1.0802 1.0656 1.0625 1.0606 1.0361 1.0546 1.0492 1.1000 1.1008 1.0960 1.1034 1.0993 1.0989 1.0993 1.0990
irintensity: 0.0643 0.0242 0.0040 0.0253 0.0060 0.1021 0.0274 0.0020 0.1342 0.4388 0.0176 0.3911 0.1464 1.9187 2.8045 2.2804 1.1810 5.7353 9.5426 3.1197 2.6469 2.0876 2.8323 0.0006 1.5098 1.3979 0.6957 1.2559 2.7634 0.4248 2.4239 1.7531 1.3360 0.7303 0.1390 1.2576 0.4855 2.1638 2.6562 6.0574 10.1550 12.1292 0.9408 4.6407 13.7120 2.0775 4.6676 32.5930 2.1667 8.9454 8.7450 0.9631 29.3623 27.1274 51.6419 77.6948 66.2007 14.6962 55.8562 39.3591 42.6561 83.9255 13.6428 133.9034 27.9079 66.7330
temp: 298.150 k
press: 1.00000 atm
elementType: 6 6 6 6 6 6 6 6 1 1 1 1 1 1 1 1 1 1 1 1 1 1 1 1
symmnumber: 1
zpe: 581799.5 jmol-1
zpe.correction: 0.221596 hartree
zpe.thermalcorrener: 0.230413 hartree
zpe.thermalcorrenthalpy: 0.231357 hartree
zpe.thermalcorrgfe: 0.189015 hartree
zpe.sumelectzpe: -313.787463 hartree
zpe.sumelectthermal: -313.778646 hartree
zpe.sumelectthermalent: -313.777701 hartree
zpe.sumelectthermalfe: -313.820043 hartree
dipole: 0.0000 0.0817 -0.1347
dipole: 0.1576
quadrupole: -53.6843 -52.9535 -51.8112
quadrupole: 0.0000 0.0000 0.2054
quadrupole: -0.8680 -0.1371 1.0052 0.0000 0.0000 0.2054
hfenergy: -314.0090585 hartree
pointgroup: C01 [X(C8H16)]
dipole: -0.0000034 0.031735 0.0532614 debye
dipolederiv: 0.0739299 0.0053201 -0.0097438 -0.0239338 0.0843807 0.0022899 -0.0571632 -0.0125222 0.1668308 0.0739283 -0.0053223 0.0097456 0.0239317 0.084386 0.0022919 0.0571684 -0.0125083 0.1668295 -0.0818527 -0.0000157 0.0000071 -0.0000168 0.0515956 -0.0361412 0.0000033 -0.0026612 0.149559 0.0234975 -0.0515473 -0.0261432 -0.0401786 0.0170893 0.0237517 0.0036311 -0.0061678 0.1486812 0.0234758 0.0515494 0.0261409 0.0401816 0.0171108 0.0237563 -0.0036262 -0.0061705 0.1486812 0.0498288 -0.0000006 0.0000034 -0.0000016 0.0575213 -0.0177096 -0.0000012 0.0234671 0.1639651 -0.0483376 -0.0557944 -0.0311197 -0.0493783 0.0181829 -0.0177749 -0.0024177 -0.0024366 0.0947119 -0.0483603 0.0557801 0.0311271 0.049364 0.0182045 -0.0177678 0.0024218 -0.0024366 0.0947111 0.0308276 -0.0002284 -0.0389276 0.0075834 0.0203816 -0.0329454 0.0017876 -0.0133507 -0.2108309 0.0308303 0.0002305 0.0389293 -0.0075817 0.0203794 -0.0329373 -0.0017903 -0.0133519 -0.210832 0.0473345 0.0000313 -0.0000089 0.0000312 -0.2089169 0.0739577 -0.0000123 0.1011012 0.0355747 0.0325592 -0.000005 -0.0000035 -0.0000041 0.0670008 0.0032735 0.0000041 -0.0597096 -0.1852186 -0.1722842 0.1269441 0.0478939 0.1074875 -0.0205373 -0.0192304 0.0725558 -0.0401515 0.0532622 0.0636852 -0.0207663 0.0043576 -0.0283774 0.0368481 -0.0442168 -0.0452813 0.0098416 -0.1931543 0.0636749 0.0207729 -0.004354 0.0283826 0.0368594 -0.0442184 0.0452721 0.009852 -0.193156 -0.1722327 -0.1269807 -0.0478833 -0.1075237 -0.0205921 -0.0192388 -0.0725403 -0.040165 0.0532654 0.0194361 0.00003 -0.000008 0.0000297 -0.2273012 0.0713081 -0.000013 0.1131419 0.0435463 0.0150015 -0.0000086 -0.000003 -0.0000074 0.0773425 0.0002625 0.0000064 -0.0804096 -0.1970685 0.0738186 0.0033857 -0.0175874 -0.0653176 -0.1742201 0.0831325 0.0038259 0.0983109 0.0474361 -0.158578 0.0681512 0.0485018 0.1346901 0.0291768 -0.0465099 0.0645012 -0.0400889 0.064509 0.0722757 -0.007293 0.0365508 -0.0122505 0.0800885 0.0040293 -0.0441138 -0.0409008 -0.1766252 0.0722714 0.0072902 -0.0365574 0.0122491 0.0800931 0.0040195 0.0441177 -0.0408915 -0.1766251 -0.158535 -0.0681951 -0.048486 -0.1347341 0.0291309 -0.0465178 -0.0644875 -0.0401021 0.0645115 0.0738052 -0.0033279 0.0175682 0.065375 -0.1742044 0.0831353 -0.0038487 0.0983102 0.0474354 unknown
polarizability: 93.4093413|0.0009818|85.1779646|-0.0002863|0.1868435|71.9845384 unknown
InChI: InChI=1S/C8H16/c1-7-4-3-5-8(2)6-7/h7-8H,3-6H2,1-2H3
charge 0 multiplicity 1
24 atoms
C  -1.29127 -0.351595 0.320931
C  1.291348 -0.35129 0.320897
C  0.000121 -1.097649 -0.102356
C  -1.2766 1.096191 -0.234404
C  1.276326 1.096491 -0.234439
C  -0.000221 1.862395 0.18416
C  -2.556908 -1.11617 -0.122172
C  2.55715 -1.115578 -0.122233
H  -1.293707 -0.285314 1.431734
H  1.293797 -0.285004 1.4317
H  0.000246 -2.120019 0.328583
H  0.00012 -1.218776 -1.208131
H  -2.180038 1.63937 0.109013
H  -1.331833 1.052453 -1.34355
H  1.33154 1.052766 -1.343587
H  2.179647 1.639881 0.108953
H  -0.000345 2.876468 -0.262338
H  -0.000222 1.999796 1.28594
H  -2.57874 -2.138654 0.301136
H  -3.477221 -0.594355 0.203088
H  -2.593476 -1.207797 -1.225624
H  2.593714 -1.2072 -1.225685
H  3.477351 -0.593553 0.203007
H  2.579223 -2.138055 0.301076
