program: Gaussian 09
title: 000252412
version: EM64L-G09RevD.01
frameworkgroup: C1[X(C22H26Cl4O2)]
method: RPBEPBE
basis: SDD
operation: Freq
keyword: #p
keyword: freq=noraman
keyword: PBEPBE/SDD
title: #p freq=noraman PBEPBE/SDD
converged: YES YES NO NO
title: Mulliken charges:
elementType: Cl Cl Cl Cl O O C C C C C C C C C C C C C C C C C C C C C C H H H H H H H H H H H H H H H H H H H H H H H H H H
charge: -0.101521 -0.093181 -0.122154 -0.117081 -0.408198 -0.413695 -0.237570 -0.236610 -0.416822 -0.420622 0.579328 0.580479 -0.705237 -0.706539 -0.532848 -0.541089 -0.638856 -0.629139 0.419767 0.420689 0.421641 0.419396 -0.007496 -0.016847 -0.806747 -0.799711 -0.766350 -0.766596 0.211528 0.210657 0.209994 0.196990 0.212142 0.196596 0.235904 0.211937 0.215999 0.216871 0.212146 0.234294 0.246413 0.245539 0.256525 0.262016 0.297891 0.303887 0.299766 0.300817 0.266830 0.305292 0.266221 0.305416 0.363263 0.358676
chargesum: 0.00000
title: Mulliken charges with hydrogens summed into heavy atoms:
elementType: Cl Cl Cl Cl O O C C C C C C C C C C C C C C C C C C C C C C
charge: -0.101521 -0.093181 -0.122154 -0.117081 -0.044935 -0.055019 -0.026043 -0.025952 -0.009837 -0.011884 0.579328 0.580479 -0.041397 -0.043229 -0.286435 -0.295551 -0.382331 -0.367122 0.419767 0.420689 0.421641 0.419396 -0.007496 -0.016847 -0.204969 -0.199128 -0.194229 -0.194958
polarizability: 3.10249736e+02 2.25542010e+01 2.81065764e+02 -1.00369412e+01 2.51745021e+01 2.65565265e+02
1716.lowfreq: -0.0015 0.0019 0.0021 1.2544 4.7203 6.6438 20.6962 26.2681 31.3296
frequency: 20.5387 26.2646 31.3131 34.0244 39.0664 42.3083 53.3298 64.6107 69.1780 77.0991 79.5067 90.0381 95.6146 116.4207 136.2075 139.8915 159.0411 161.5206 169.1551 175.1236 181.4541 230.9782 237.9715 249.9376 253.0354 261.8537 264.6943 269.8744 286.1942 303.8164 312.7917 316.5524 353.1291 377.2325 397.3003 406.3429 455.3920 466.3162 477.9875 491.2952 517.3318 522.1068 538.2555 543.9932 550.6791 562.6813 569.9276 575.3921 579.3858 625.2869 633.6540 639.8477 651.2437 659.2157 671.2156 732.0817 734.8205 767.0568 769.6598 801.3655 814.7608 874.0325 884.1394 893.6581 901.0860 909.1025 910.5006 915.4810 928.8662 934.8587 938.9256 970.1654 974.1091 987.0424 998.9520 999.6706 1032.3714 1062.2830 1082.2474 1089.7692 1093.3931 1111.2632 1118.5060 1119.9965 1124.1226 1125.6430 1164.4282 1169.2657 1202.1781 1205.0648 1217.2183 1239.4371 1240.0737 1241.6681 1241.9874 1245.7554 1247.4635 1257.8158 1261.2702 1290.2394 1297.0355 1302.7645 1303.9904 1305.1250 1327.7983 1333.1852 1343.2318 1349.1669 1390.3738 1393.4508 1395.2813 1397.0413 1436.0350 1439.4844 1449.6895 1451.1444 1454.9230 1456.1544 1466.5259 1474.2504 1475.8706 1477.3206 1479.3092 1479.5739 1486.1748 1487.3560 1604.1839 1605.2442 1615.7471 1617.3712 2956.1099 2966.5508 2976.2550 2978.0411 2978.7892 2981.5388 3031.2435 3039.9288 3062.6885 3063.1566 3070.4612 3071.0354 3080.9286 3082.3018 3083.0480 3084.0433 3119.0720 3119.9462 3124.3167 3125.8648 3156.0164 3157.6959 3173.9432 3175.5648 3391.3944 3399.6301
redmass: 11.1176 7.8026 10.6675 6.6059 9.5373 8.4545 7.7095 3.6184 6.9881 6.9648 5.4249 2.3610 5.5774 5.4818 6.7834 3.0380 3.1613 3.2749 2.3101 4.6239 5.6442 1.3669 1.3190 2.5122 2.9621 4.2651 5.7982 4.6149 5.5710 3.7146 3.3772 3.3165 4.3879 4.7262 4.0860 3.7884 4.6496 4.0938 4.9074 3.9679 4.0731 4.7666 4.4764 2.3302 2.5925 2.1817 1.9903 3.0664 2.5587 3.8243 2.9998 4.5463 4.6989 4.2160 3.7333 2.8694 2.9523 4.0321 4.2501 1.4434 1.5843 1.8639 1.9164 1.6105 1.7776 1.5926 1.5994 1.6223 1.7427 1.5104 1.5640 3.0185 2.1165 3.6397 3.4052 3.2847 1.9191 1.8815 1.7333 2.2378 2.1804 1.8330 1.2096 1.1233 1.2586 1.2192 1.9031 1.9312 1.7271 1.8080 1.4163 1.1525 1.1452 1.1389 1.2706 1.3055 1.1477 1.6924 1.6910 1.3381 2.1729 1.4031 1.9932 1.4269 1.4978 1.4346 2.0340 2.3368 1.2142 4.3180 1.2525 4.6833 2.8567 2.7665 1.2502 1.1981 1.3604 1.3954 1.0743 1.0445 1.0617 1.0438 2.3605 2.3772 1.0603 1.0710 6.2143 6.1863 6.5771 6.5286 1.0807 1.0745 1.0645 1.0374 1.0369 1.0709 1.0985 1.0948 1.0596 1.0585 1.0996 1.0996 1.0583 1.0999 1.0584 1.0995 1.0905 1.0908 1.0921 1.0923 1.1107 1.1091 1.1109 1.1110 1.0660 1.0663
irintensity: 0.0932 0.0588 1.7385 1.0598 0.0333 1.3765 1.2602 0.2269 0.1075 1.9820 1.8834 0.3459 0.4139 0.5535 3.3931 0.1124 0.8914 4.3707 0.5632 4.4959 3.7844 0.1216 0.3494 2.8411 4.1125 0.3923 2.8239 1.7883 11.6378 1.0377 6.6972 17.2529 4.0941 2.8239 0.6579 8.6902 6.9232 8.8894 12.1979 22.4483 4.3306 20.2979 32.1641 197.6849 56.6989 49.2902 57.1494 81.4429 34.6826 9.0533 27.9839 1.6675 9.1059 0.7635 1.3927 8.3493 8.3256 21.1465 15.6674 1.2439 2.8309 1.2302 20.8951 4.6963 9.2527 1.9813 6.2026 8.3233 5.4793 4.3699 11.1855 8.4428 3.8216 1.9295 34.4204 45.2789 0.9204 2.6737 5.1741 11.6732 1.5108 10.8275 1.9458 14.2459 6.3393 14.1186 89.1335 35.7008 92.6105 120.2868 4.5712 24.0643 23.8393 2.2474 2.8010 0.2453 16.3751 21.0745 12.7443 0.2721 4.6190 26.6188 3.9275 20.1962 6.1580 7.6715 8.8304 16.9307 13.0958 19.0566 12.9294 18.1742 3.0104 12.1362 23.3282 19.1958 12.2247 14.3718 2.4248 9.9576 4.1624 8.0226 36.7563 67.0726 14.3733 7.5508 13.5676 33.1495 10.0256 16.6483 2.1545 7.6817 13.8352 54.9204 23.6902 44.9136 20.5742 31.3283 4.0217 12.2240 38.2388 43.1918 17.8846 23.7142 19.4946 95.9213 7.0938 6.9581 4.1531 2.3924 0.0084 0.4340 0.2993 0.3175 143.3406 172.0437
temp: 298.150 k
press: 1.00000 atm
elementType: 17 17 17 17 8 8 6 6 6 6 6 6 6 6 6 6 6 6 6 6 6 6 6 6 6 6 6 6 1 1 1 1 1 1 1 1 1 1 1 1 1 1 1 1 1 1 1 1 1 1 1 1 1 1
symmnumber: 1
zpe: 1121994.2 jmol-1
zpe.correction: 0.427345 hartree
zpe.thermalcorrener: 0.457741 hartree
zpe.thermalcorrenthalpy: 0.458685 hartree
zpe.thermalcorrgfe: 0.363077 hartree
zpe.sumelectzpe: -2842.566471 hartree
zpe.sumelectthermal: -2842.536075 hartree
zpe.sumelectthermalent: -2842.535131 hartree
zpe.sumelectthermalfe: -2842.630739 hartree
dipole: -4.4485 -2.0406 -1.0390
dipole: 5.0033
quadrupole: -194.1267 -194.4637 -203.9177
quadrupole: 2.7659 0.4409 -9.9510
quadrupole: 3.3760 3.0390 -6.4150 2.7659 0.4409 -9.9510
hfenergy: -2842.993816 hartree
pointgroup: C01 [X(C22H26Cl4O2)]
dipole: 0.768316 -1.709868 0.6006829 debye
polarizability: 251.2165048|-21.8617011|314.0780749|-11.7918302|-11.245276|291.586185 unknown
InChI: InChI=1S/C22H26Cl4O2/c1-3-19(13-5-15(9-23)21(27)16(6-13)10-24)20(4-2)14-7-17(11-25)22(28)18(8-14)12-26/h5-8,19-20,27-28H,3-4,9-12H2,1-2H3
charge 0 multiplicity 1
54 atoms
Cl -3.129137 2.739211 -2.862686
Cl 0.673626 3.887739 1.083488
Cl -1.908834 1.20761 3.796162
Cl 2.07875 0.832109 -3.846376
O  -3.100802 2.531068 0.313679
O  3.012429 2.699368 -0.661985
C  -0.474411 -2.578592 -0.245499
C  0.809434 -2.463424 0.686821
C  -1.336493 -3.830389 0.077198
C  1.759042 -3.684912 0.547188
C  -1.272518 -1.2743 -0.160704
C  1.511083 -1.130338 0.410232
C  -2.549916 -3.994139 -0.863537
C  2.985297 -3.617461 1.484046
C  -1.977353 -0.924443 1.013563
C  2.252822 -0.921809 -0.775434
C  -1.194384 -0.309352 -1.193213
C  1.311667 -0.019586 1.264717
C  -2.579975 0.34457 1.185054
C  2.748527 0.352608 -1.141935
C  -1.759314 0.980957 -1.057167
C  1.822886 1.265024 0.9593
C  -2.484499 1.292879 0.130602
C  2.523694 1.449815 -0.26833
C  -1.482267 2.034513 -2.076402
C  1.633598 2.394796 1.91571
C  -3.242924 0.71121 2.468961
C  3.414547 0.56881 -2.458941
H  -0.104865 -2.685023 -1.287732
H  0.442319 -2.443381 1.735128
H  -0.706715 -4.736419 0.004427
H  -1.684955 -3.779971 1.129283
H  1.195848 -4.610224 0.768194
H  2.097974 -3.775286 -0.505215
H  -3.23885 -3.13421 -0.787859
H  -2.22569 -4.071131 -1.918693
H  -3.118829 -4.909755 -0.618851
H  3.617198 -4.51745 1.372672
H  2.6709 -3.555666 2.543162
H  3.610399 -2.732878 1.268411
H  -2.041086 -1.637773 1.844944
H  2.414434 -1.754237 -1.471471
H  -0.622841 -0.537924 -2.101477
H  0.726734 -0.14483 2.184255
H  -0.904422 1.670779 -2.935526
H  -1.032128 2.945544 -1.653158
H  2.565187 2.890005 2.22787
H  1.000735 2.134576 2.774008
H  -3.761685 -0.125066 2.956896
H  -3.871979 1.606198 2.393081
H  3.973194 -0.304947 -2.820902
H  4.006306 1.49066 -2.503099
H  -3.26885 2.976996 -0.56425
H  2.48349 3.43567 -0.241805
