program: Gaussian 09
title: 000252342
version: EM64L-G09RevD.01
frameworkgroup: C1[X(C16H14O5)]
method: RPBEPBE
basis: SDD
operation: Freq
keyword: #pfreq=noraman
keyword: PBEPBE/SDD
title: #p freq=noraman PBEPBE/SDD
converged: YES YES NO NO
title: Mulliken charges:
elementType: O O O O O C C C C C C C C C C C C C C C C H H H H H H H H H H H H H H
charge: -0.303458 -0.407326 -0.407327 -0.234239 -0.234234 0.445895 0.445889 0.330640 0.330640 -0.618137 -0.618141 -0.389134 -0.389114 -0.342604 -0.342604 -0.381571 -0.381573 -0.356557 -0.356558 0.214170 0.214171 0.247438 0.242060 0.247435 0.242058 0.237802 0.237804 0.259406 0.259398 0.257988 0.257988 0.268686 0.268686 0.377212 0.377213
chargesum: 0.00000
title: Mulliken charges with hydrogens summed into heavy atoms:
elementType: O O O O O C C C C C C C C C C C C C C C C
charge: -0.303458 -0.030114 -0.030115 -0.234239 -0.234234 0.445895 0.445889 0.330640 0.330640 -0.128639 -0.128649 -0.151332 -0.151310 -0.083199 -0.083205 -0.123583 -0.123585 -0.087871 -0.087871 0.214170 0.214171
polarizability: 2.81464420e+02 -1.62030682e-03 1.78988404e+02 -1.16181281e+01 -1.87334908e-03 1.23067034e+02
1716.lowfreq: -3.4479 -0.0009 -0.0008 -0.0004 3.0958 7.4239 14.7873 21.5163 22.5504
frequency: 14.7501 21.4755 22.5248 25.1375 29.3763 34.3994 60.9970 69.7998 108.4322 147.9417 170.5314 233.0146 242.1700 319.9472 328.7638 340.8608 379.0617 396.3987 402.3183 411.0336 414.9192 462.9350 475.6150 504.5714 522.6434 541.7481 561.4023 617.7851 620.0218 634.0340 640.6713 674.2718 691.3755 704.0524 712.8078 758.9629 795.2058 811.5469 828.2524 829.3021 835.7053 839.4850 858.1414 869.5541 874.8789 927.6282 929.0576 953.7871 955.6618 967.0648 974.6722 1006.5453 1007.5366 1055.6870 1056.3649 1113.7567 1116.2414 1154.2410 1175.1304 1179.5743 1181.2810 1196.1315 1200.9132 1204.0200 1228.1323 1271.8880 1272.0824 1298.9223 1304.5844 1322.1802 1326.6327 1378.1571 1388.8907 1413.0022 1417.8035 1454.3154 1454.4086 1488.1219 1496.9360 1585.0830 1595.6363 1610.5131 1622.1539 1661.8045 1662.6864 3020.1566 3020.2070 3103.4557 3103.4611 3135.1170 3135.2228 3139.5826 3140.3529 3163.2875 3165.3921 3170.6689 3171.0811 3504.5781 3504.5946
redmass: 6.5980 6.1728 4.7219 6.5004 11.7142 5.7704 3.8334 8.0898 6.6258 6.0929 7.1874 5.2528 5.2189 5.0685 5.6513 5.9378 5.4362 2.4950 2.2043 2.9310 2.9706 3.8709 3.8308 2.8956 2.8615 3.8458 3.9645 3.2999 2.3129 2.9704 2.4841 2.7537 2.8653 3.6664 3.9213 5.2662 2.6366 2.6594 2.4621 1.3165 1.7553 1.9563 6.3339 3.2008 2.8210 1.9200 1.9372 1.4129 1.3977 1.3646 1.3480 2.8081 2.9210 1.9312 1.9242 1.3405 1.3246 2.2589 1.2500 1.2178 1.2658 1.4006 1.9443 2.7143 5.6350 1.4579 1.4606 1.3474 1.4025 2.2924 1.9712 4.2990 6.1067 3.1360 2.9688 1.1048 1.1033 2.4214 2.5284 7.1751 7.4158 6.2785 6.4951 8.5255 8.5171 1.0621 1.0621 1.1002 1.1002 1.0898 1.0898 1.0890 1.0892 1.0960 1.0953 1.0958 1.0960 1.0639 1.0639
irintensity: 0.3905 1.8469 2.0653 0.1776 0.7114 4.3794 0.0024 0.0157 0.5712 0.1558 2.8223 0.0001 0.8429 2.4603 0.8293 0.0534 1.3925 15.3649 0.4570 2.3594 0.1985 14.5574 0.5226 11.1482 46.0948 92.5890 4.4682 0.0493 157.1872 91.9067 4.0538 6.6375 107.4974 9.1265 10.3788 4.6736 35.4294 17.9269 80.6216 4.1247 4.5647 1.7732 36.1495 29.0577 4.3591 54.9658 0.0972 15.6602 1.0201 0.5615 0.3108 33.1138 1.3464 434.7064 11.8664 67.7298 7.4931 4.9972 133.3672 5.5483 14.8758 0.1855 60.4398 1.7158 435.1296 6.7034 1.5286 2.9870 15.1674 82.8062 35.5110 21.4610 2.6665 3.9599 0.1993 51.9928 1.9261 353.7671 31.4115 2.0117 0.1671 96.9272 3.1185 117.2448 286.4190 30.2434 0.6183 5.7699 4.2872 24.5731 2.4130 15.6730 2.1225 7.6033 2.6117 1.2232 5.6948 31.7011 13.0202
temp: 298.150 k
press: 1.00000 atm
elementType: 8 8 8 8 8 6 6 6 6 6 6 6 6 6 6 6 6 6 6 6 6 1 1 1 1 1 1 1 1 1 1 1 1 1 1
symmnumber: 1
zpe: 693386.7 jmol-1
zpe.correction: 0.264097 hartree
zpe.thermalcorrener: 0.283321 hartree
zpe.thermalcorrenthalpy: 0.284265 hartree
zpe.thermalcorrgfe: 0.210438 hartree
zpe.sumelectzpe: -992.734295 hartree
zpe.sumelectthermal: -992.715071 hartree
zpe.sumelectthermalent: -992.714127 hartree
zpe.sumelectthermalfe: -992.787954 hartree
dipole: 0.0000 1.1909 0.0000
dipole: 1.1909
quadrupole: -97.8703 -127.3829 -116.5846
quadrupole: 0.0005 -7.3597 -0.0005
quadrupole: 16.0756 -13.4370 -2.6386 0.0005 -7.3597 -0.0005
hfenergy: -992.9983918 hartree
pointgroup: C01 [X(C16H14O5)]
dipole: 0.0000632 -0.468546 -0.0001779 debye
polarizability: 281.9713298|0.0162047|178.9884002|7.3776894|0.0194834|122.5601271 unknown
InChI: InChI=1S/C16H14O5/c17-15(18)9-11-1-5-13(6-2-11)21-14-7-3-12(4-8-14)10-16(19)20/h1-8,17,19H,9-10H2
charge 0 multiplicity 1
35 atoms
O  -0.000198 -2.079555 -0.000689
O  -6.053288 1.615394 -1.056536
O  6.051565 1.616567 1.057886
O  -4.762472 2.820663 0.452416
O  4.760462 2.822613 -0.450201
C  -3.770664 -0.222796 0.593942
C  3.769628 -0.221085 -0.59402
C  -1.223461 -1.383887 0.17132
C  1.222825 -1.383345 -0.172208
C  -5.147783 0.402076 0.826833
C  5.146528 0.404432 -0.826467
C  -3.642399 -1.442804 -0.113975
C  3.641772 -1.441564 0.113158
C  -2.599252 0.405501 1.08903
C  2.598013 0.407087 -1.088786
C  -2.375776 -2.027172 -0.327784
C  2.375349 -2.026515 0.326561
C  -1.326842 -0.166984 0.886222
C  1.325801 -0.165981 -0.886384
C  -5.277341 1.735553 0.105008
C  5.275643 1.737392 -0.103606
H  -5.295616 0.601913 1.903686
H  -5.943278 -0.275293 0.480555
H  5.29426 0.605161 -1.903166
H  5.942265 -0.272934 -0.480736
H  -4.536765 -1.940165 -0.50629
H  4.536302 -1.938839 0.505208
H  -2.683543 1.352767 1.633467
H  2.681988 1.354707 -1.632656
H  -2.265156 -2.970933 -0.869614
H  2.265044 -2.970643 0.867816
H  -0.431915 0.318457 1.287249
H  0.43072 0.319372 -1.287173
H  -6.0859 2.495312 -1.522838
H  6.083882 2.496132 1.524876
