program: Gaussian 09
title: 000252336
version: EM64L-G09RevD.01
frameworkgroup: C1[X(C16H24N2)]
method: RPBEPBE
basis: SDD
operation: Freq
keyword: #pfreq=noraman
keyword: PBEPBE/SDD
title: #p freq=noraman PBEPBE/SDD
converged: YES YES NO NO
title: Mulliken charges:
elementType: N N C C C C C C C C C C C C C C C C H H H H H H H H H H H H H H H H H H H H H H H H
charge: -0.456629 -0.065941 -0.386733 -0.380165 -0.364455 -0.372657 -0.387722 -0.353099 -0.519103 -0.356749 0.160241 0.291467 0.015808 -0.696057 -0.380362 -0.354071 -0.215933 -0.234778 0.198863 0.191635 0.194330 0.191224 0.203295 0.191209 0.188846 0.191141 0.186605 0.230201 0.187259 0.188601 0.248214 0.214271 0.195515 0.194462 0.303430 0.215515 0.209402 0.210104 0.229854 0.247364 0.221860 0.223740
chargesum: 0.00000
title: Mulliken charges with hydrogens summed into heavy atoms:
elementType: N N C C C C C C C C C C C C C C C C
charge: -0.153198 -0.065941 0.003765 0.005389 0.030048 0.007330 0.029084 0.022761 -0.056618 0.033228 0.160241 0.291467 0.015808 -0.061036 -0.150508 -0.106707 0.005926 -0.011038
polarizability: 2.71380647e+02 1.70076985e+01 1.59323056e+02 2.50438444e+01 -1.32243997e+01 1.37537473e+02
1716.lowfreq: -26.1370 -0.0009 0.0001 0.0007 1.9234 5.0908 13.9297 18.4021 25.7260
frequency: -14.6722 18.2744 25.6342 34.7562 59.7608 64.8307 87.8171 109.4715 131.9694 138.2890 145.8215 152.9179 211.8648 227.9087 252.0810 255.7118 289.0109 341.0594 373.1731 432.4665 456.0299 466.7549 481.4086 530.6213 582.1631 593.4382 612.8875 668.9121 717.8528 720.4841 725.5487 731.3900 753.5850 759.8251 771.4437 809.6429 826.5799 855.7639 870.5699 884.6315 888.6288 934.4382 944.8735 964.1003 974.5751 989.5275 995.3888 1006.8572 1012.1552 1036.0625 1051.1139 1067.6161 1079.5687 1080.8396 1083.9737 1109.9684 1120.6472 1159.0423 1182.4338 1202.4994 1209.0022 1211.3570 1222.1247 1244.1925 1248.3754 1260.5378 1272.6460 1279.8320 1282.7739 1286.1240 1292.9239 1295.8215 1305.6898 1314.7450 1336.5064 1350.6422 1356.1321 1357.6250 1364.3708 1390.3537 1413.0219 1444.7246 1453.3420 1459.4265 1460.5164 1463.2821 1466.3598 1472.5123 1474.6055 1477.2206 1478.9741 1484.6220 1488.2271 1527.3054 1594.3942 1634.1523 2949.9557 2950.6165 2952.4076 2955.5854 2961.4095 2966.9058 2968.7279 2971.6888 2976.6027 2983.3675 2989.3522 2998.0254 3010.3191 3023.5779 3034.8678 3043.0689 3067.9842 3070.7553 3072.8536 3128.0334 3140.4797 3155.9555 3170.2021 3596.2099
redmass: 1.7919 4.1154 4.0859 2.9020 2.2492 3.2779 2.2707 1.8953 3.7421 2.1909 1.9993 4.8234 3.6397 1.1235 4.5113 2.8344 3.7397 4.0201 3.4360 2.9707 3.5060 3.3041 3.3048 5.6047 2.8322 1.3029 6.7306 4.6318 1.0596 1.0908 3.1161 1.2338 1.3771 1.2119 3.6321 1.3335 3.5603 1.5141 1.9416 2.2235 1.9038 1.3849 1.3601 4.3365 1.3041 4.4367 3.9370 1.7760 1.3297 3.3666 3.1197 2.6302 2.1685 2.2590 1.4175 1.6151 2.6787 1.1420 1.8537 2.0581 1.5236 1.5066 1.4888 1.4133 1.3034 2.2808 1.3516 1.0474 1.2983 1.1232 1.1283 1.1277 1.6649 1.4294 1.4200 1.5439 1.6531 1.6194 2.8433 1.2175 2.8812 3.6688 1.0995 1.0741 1.0754 1.0657 1.0842 1.1105 2.9783 1.0431 1.0877 1.0901 1.0920 5.3944 6.9359 7.4263 1.0587 1.0588 1.0592 1.0595 1.0597 1.0615 1.0591 1.0368 1.0671 1.0959 1.0971 1.0995 1.1017 1.1027 1.1028 1.1031 1.1007 1.0993 1.0974 1.0853 1.0904 1.0956 1.0992 1.0811
irintensity: 0.7547 1.5826 0.0280 0.4529 0.0900 0.1861 0.1065 0.0334 1.5360 0.2575 0.0319 0.2309 1.4073 0.0032 5.8633 1.7739 0.4032 0.1003 1.8121 7.2684 4.9256 0.4513 3.1366 0.0112 12.7243 74.6913 0.6278 5.4870 16.6913 0.1696 10.0957 4.9846 103.0055 2.6611 5.2511 0.8030 2.5455 0.1445 2.0552 0.2589 4.9756 4.1594 0.0297 0.1791 0.0734 0.3830 1.9356 6.1968 1.8041 0.4380 2.3123 1.1538 0.0599 1.0258 3.4313 2.9390 16.6406 2.9178 0.8279 9.1695 11.1764 5.4671 3.7166 8.4966 0.6212 30.7738 4.3977 0.2648 0.3687 0.1241 0.5703 0.3699 8.5661 5.4528 3.2921 0.6428 0.8508 0.2121 57.9899 11.2894 4.8594 42.7723 2.4298 0.2025 0.3072 0.2611 0.8012 1.8082 0.2373 12.0932 3.1346 3.9562 31.0130 84.0457 0.7816 8.7960 0.0962 0.2284 2.5670 0.3470 29.7199 7.8109 193.2251 35.8727 48.7796 2.6980 2.8513 2.0604 1.6524 1.1951 14.8197 178.2792 95.0655 54.6698 33.8076 0.1436 13.2776 27.4077 21.8662 31.3568
temp: 298.150 k
press: 1.00000 atm
elementType: 7 7 6 6 6 6 6 6 6 6 6 6 6 6 6 6 6 6 1 1 1 1 1 1 1 1 1 1 1 1 1 1 1 1 1 1 1 1 1 1 1 1
symmnumber: 1
zpe: 962216.7 jmol-1
zpe.correction: 0.366489 hartree
zpe.thermalcorrener: 0.384689 hartree
zpe.thermalcorrenthalpy: 0.385633 hartree
zpe.thermalcorrgfe: 0.317257 hartree
zpe.sumelectzpe: -732.250682 hartree
zpe.sumelectthermal: -732.232481 hartree
zpe.sumelectthermalent: -732.231537 hartree
zpe.sumelectthermalfe: -732.299913 hartree
dipole: -1.9737 2.5948 -2.0240
dipole: 3.8374
quadrupole: -115.4421 -110.5464 -108.9824
quadrupole: 10.0958 -2.4044 -4.1552
quadrupole: -3.7851 1.1106 2.6745 10.0958 -2.4044 -4.1552
hfenergy: -732.6171705 hartree
pointgroup: C01 [X(C16H24N2)]
dipole: -0.7725062 -1.0969018 0.692363 debye
polarizability: 271.5718451|-13.9914011|161.5495458|-26.3633777|-11.001742|135.1197856 unknown
InChI: InChI=1S/C16H24N2/c1-2-3-4-5-6-7-8-13-16-17-14-11-9-10-12-15(14)18-16/h9-12,17H,2-8,13H2,1H3
charge 0 multiplicity 1
42 atoms
N  2.719809 -0.619641 0.895469
N  2.959988 1.399173 -0.138343
C  -2.905564 -0.100123 -0.072455
C  -4.325636 0.336974 0.352851
C  -1.785242 0.653432 0.679075
C  -5.448433 -0.413689 -0.398347
C  -0.367098 0.219398 0.247968
C  -6.868206 0.024147 0.026953
C  0.744122 0.987763 1.018021
C  -7.992045 -0.725447 -0.724746
C  2.135419 0.623311 0.587661
C  4.00332 -0.645607 0.328461
C  4.137792 0.632876 -0.316876
C  -9.406649 -0.281296 -0.293185
C  5.028911 -1.612374 0.313738
C  5.332687 0.954615 -0.998623
C  6.214473 -1.270195 -0.37374
C  6.364059 -0.007934 -1.019339
H  -2.78519 0.058786 -1.164244
H  -2.792966 -1.191668 0.09697
H  -4.438418 1.428297 0.183644
H  -4.446355 0.178192 1.445115
H  -1.899291 1.74406 0.509107
H  -1.904784 0.494303 1.771635
H  -5.336395 -1.505441 -0.229755
H  -5.328359 -0.254523 -1.490516
H  -0.253333 -0.87324 0.406367
H  -0.235181 0.39509 -0.837347
H  -6.99027 -0.135341 1.119009
H  -6.981756 1.115684 -0.141521
H  0.627152 2.071432 0.844811
H  0.620551 0.813663 2.106461
H  -7.869825 -0.565335 -1.815528
H  -7.87815 -1.815943 -0.556405
H  2.280213 -1.364596 1.432742
H  -10.191133 -0.831476 -0.844785
H  -9.564965 -0.459022 0.787427
H  -9.556351 0.799007 -0.479813
H  4.924357 -2.584877 0.806611
H  5.441452 1.925317 -1.491824
H  7.038504 -1.991395 -0.411577
H  7.30099 0.215442 -1.541228
