program: Gaussian 09
title: 000252327
version: EM64L-G09RevD.01
frameworkgroup: C1[X(C9H18)]
method: RPBEPBE
basis: SDD
operation: Freq
keyword: #p
keyword: freq=noraman
keyword: PBEPBE/SDD
title: #p freq=noraman PBEPBE/SDD
converged: YES YES NO NO
title: Mulliken charges:
elementType: C C C C C C C C C H H H H H H H H H H H H H H H H H H
charge: -0.017235 -0.002750 0.005471 -0.454410 -0.438719 -0.426216 -0.766415 -0.764347 -0.748994 0.187254 0.186666 0.193320 0.183916 0.188732 0.190517 0.190734 0.185559 0.194643 0.207828 0.211521 0.221747 0.210848 0.221354 0.207490 0.207327 0.212051 0.212107
chargesum: 0.00000
title: Mulliken charges with hydrogens summed into heavy atoms:
elementType: C C C C C C C C C
charge: 0.170019 0.183916 0.198791 -0.081762 -0.057467 -0.046014 -0.125319 -0.124654 -0.117509
polarizability: 1.07659543e+02 2.32713741e-01 9.58479634e+01 2.49091067e-01 1.70091571e-01 7.98367511e+01
1716.lowfreq: -13.3259 0.0004 0.0005 0.0010 4.1540 30.3838 89.6709 140.1733 191.4106
frequency: 89.6650 140.1623 191.3938 201.4828 209.5194 232.0880 253.5567 309.6846 334.2718 353.7294 385.7687 431.3747 445.5532 483.6300 564.9823 737.2833 807.5925 827.8215 859.6598 905.8923 926.0455 942.3704 951.6347 969.7798 999.7932 1032.7013 1049.4168 1066.0985 1073.6962 1120.7334 1126.7760 1167.5568 1175.8604 1192.3593 1234.7442 1251.1184 1268.5209 1287.6242 1299.6061 1307.1417 1317.6483 1336.0993 1341.0789 1346.0450 1358.2412 1379.7968 1382.5568 1387.2042 1453.1302 1460.3675 1466.9491 1472.2543 1473.2678 1475.0508 1476.9013 1478.5917 1491.0689 2923.9892 2935.8663 2940.6557 2946.9391 2955.0334 2956.5706 2963.9242 2967.0665 2968.9360 3006.7801 3013.5628 3022.6584 3055.5706 3057.0435 3058.2250 3062.1576 3071.3285 3078.5177
redmass: 2.6429 2.1915 1.0773 1.1711 1.0964 1.9115 2.2984 1.8095 1.9287 3.0348 2.9861 1.9504 2.9403 2.3270 2.3672 2.1621 1.8843 1.8439 1.6382 1.5726 1.4051 1.5806 1.5214 1.3033 1.2835 2.3497 1.7095 1.5761 1.7179 3.0300 2.1139 2.3059 1.9001 1.9014 1.3293 1.4241 1.2060 1.3856 1.2472 1.2613 1.3832 1.4545 1.5795 1.6883 1.6169 1.2214 1.2194 1.2090 1.0864 1.0834 1.0890 1.0458 1.0576 1.0573 1.0610 1.0498 1.0481 1.0796 1.0738 1.0822 1.0651 1.0642 1.0637 1.0367 1.0366 1.0377 1.0999 1.0972 1.1026 1.0988 1.0986 1.0987 1.0992 1.0987 1.0972
irintensity: 0.0230 0.0315 0.0114 0.0598 0.0117 0.0061 0.1054 0.0071 0.1717 0.0776 0.1442 0.2086 0.1221 0.0500 0.1097 0.0324 0.2300 1.2341 2.8484 3.6982 1.8812 4.9980 4.6880 11.6853 5.7581 4.3500 3.4671 0.9643 1.0517 1.5872 2.7098 1.0885 2.1405 0.4704 0.3123 0.9467 1.1135 1.1488 0.4835 0.3005 0.6803 0.7198 1.0723 0.2930 5.3907 18.1125 7.3220 15.7745 2.6326 8.4010 1.3460 19.3662 17.4473 13.5585 4.9487 11.2007 4.3360 0.0496 14.5238 1.9351 25.8915 76.8346 32.9467 65.7537 58.6667 29.2532 52.2116 30.1191 71.5441 0.8416 46.7311 131.3291 48.0909 50.3197 41.9035
temp: 298.150 k
press: 1.00000 atm
elementType: 6 6 6 6 6 6 6 6 6 1 1 1 1 1 1 1 1 1 1 1 1 1 1 1 1 1 1
symmnumber: 1
zpe: 653698.0 jmol-1
zpe.correction: 0.248980 hartree
zpe.thermalcorrener: 0.259327 hartree
zpe.thermalcorrenthalpy: 0.260271 hartree
zpe.thermalcorrgfe: 0.214515 hartree
zpe.sumelectzpe: -353.011254 hartree
zpe.sumelectthermal: -353.000908 hartree
zpe.sumelectthermalent: -352.999964 hartree
zpe.sumelectthermalfe: -353.045720 hartree
dipole: 0.0324 -0.0565 -0.0668
dipole: 0.0933
quadrupole: -60.7077 -59.6140 -58.3290
quadrupole: -0.0366 -0.3765 -0.3153
quadrupole: -1.1575 -0.0638 1.2212 -0.0366 -0.3765 -0.3153
hfenergy: -353.2602348 hartree
pointgroup: C01 [X(C9H18)]
dipole: 0.0129302 0.0219092 0.0264532 debye
polarizability: 107.6548309|-0.2604923|95.8441904|-0.3958111|0.3347807|79.8452365 unknown
InChI: InChI=1S/C9H18/c1-7-4-5-8(2)9(3)6-7/h7-9H,4-6H2,1-3H3
charge 0 multiplicity 1
27 atoms
C  -0.802655 -0.833011 0.292872
C  -1.234054 0.545524 -0.294166
C  1.667798 -0.051965 0.335585
C  0.667403 -1.154107 -0.089157
C  -0.229557 1.6517 0.126198
C  1.226527 1.308657 -0.256777
C  -1.729926 -1.988839 -0.147606
C  -2.670541 0.946511 0.11128
C  3.113165 -0.408125 -0.071792
H  -0.853764 -0.747485 1.402297
H  -1.19507 0.457117 -1.403928
H  1.627379 0.034194 1.444312
H  0.730674 -1.290785 -1.191233
H  0.961568 -2.121965 0.366172
H  -0.296959 1.795068 1.226104
H  -0.527866 2.613705 -0.336806
H  1.316382 1.262352 -1.36334
H  1.911273 2.110182 0.085991
H  -1.767304 -2.060724 -1.252471
H  -1.358161 -2.957162 0.238029
H  -2.76351 -1.859236 0.219245
H  -2.91272 1.960512 -0.259637
H  -3.42938 0.254218 -0.294428
H  -2.776368 0.95874 1.213992
H  3.197021 -0.503775 -1.17201
H  3.826506 0.372932 0.253177
H  3.434039 -1.368127 0.374998
