program: Gaussian 09
title: 000019627
version: EM64L-G09RevD.01
frameworkgroup: C1[X(C13H11FN2O3)]
method: RPBEPBE
basis: SDD
operation: Freq
keyword: #p
keyword: freq=noraman
keyword: PBEPBE/SDD
title: #p freq=noraman PBEPBE/SDD
converged: YES YES NO NO
title: Mulliken charges:
elementType: F O O O N N C C C C C C C C C C C C C H H H H H H H H H H H
charge: -0.199863 -0.226707 -0.214200 -0.213822 -0.371090 -0.368237 -0.049683 -0.510538 0.426711 0.193028 0.124445 -0.341556 -0.338017 -0.040526 0.157886 -0.386139 -0.389954 0.329292 -0.576926 0.245914 0.247358 0.263648 0.286904 0.369434 0.369834 0.242718 0.260482 0.260797 0.219273 0.229532
chargesum: 0.00000
title: Mulliken charges with hydrogens summed into heavy atoms:
elementType: F O O O N N C C C C C C C C C C C C C
charge: -0.199863 -0.226707 -0.214200 -0.213822 -0.001656 0.001597 -0.049683 -0.017266 0.426711 0.193028 0.124445 -0.077907 -0.051113 0.202192 0.157886 -0.125657 -0.129156 0.329292 -0.128120
polarizability: 1.86958631e+02 -1.64779167e-01 1.44743648e+02 -5.38719459e+00 1.71124066e+01 1.41587039e+02
1716.lowfreq: -11.0418 -4.7985 -0.0006 -0.0005 0.0007 5.3392 26.7415 31.9954 53.8541
frequency: 26.1891 31.9819 53.8272 77.3200 89.2371 123.5582 149.9982 163.3091 166.1869 191.9935 228.9452 251.6488 296.6572 345.1742 357.6687 366.8583 400.4990 404.7030 411.6406 444.1722 477.8799 486.0331 533.5714 576.4655 621.5590 628.0651 635.6802 649.1243 654.3244 691.1840 722.3138 755.1433 769.0086 785.8663 796.8030 821.7877 840.2933 847.4024 896.7436 951.2354 954.7058 961.7380 978.8436 992.8922 1001.7016 1007.2763 1016.3234 1057.7861 1120.5678 1142.4539 1149.4707 1167.3378 1205.2520 1221.4755 1267.8667 1281.7698 1294.8494 1311.2732 1323.1618 1360.8363 1368.0971 1378.3301 1379.4711 1408.7500 1423.7023 1451.0223 1493.6908 1597.3067 1608.3473 1612.9823 1649.6123 1656.3120 1681.2583 3022.5548 3085.9127 3092.7647 3109.0362 3153.4744 3161.4392 3177.4710 3181.7896 3201.0069 3517.0899 3519.8982
redmass: 4.2271 9.9189 4.3179 3.7346 3.9197 5.4077 7.2620 5.1023 12.2703 7.3753 3.7383 4.9514 5.1456 5.5302 11.3914 7.5397 3.9273 2.9344 3.0429 2.9777 5.9902 8.2196 2.9066 6.0918 4.1071 2.8582 5.2506 3.6955 2.7353 4.2361 3.9418 1.8347 3.1620 1.7246 6.3455 1.2807 1.5292 2.0227 4.0261 1.5820 1.7470 1.3733 1.3416 3.5040 2.1677 2.8141 1.2334 7.0656 1.3785 2.6691 2.3899 2.1754 3.6127 1.7911 1.4842 1.3913 1.6194 1.2861 2.0303 9.2374 7.3782 1.4495 2.2188 3.3064 1.1550 1.1263 2.3176 7.5831 6.1541 6.7360 8.6808 4.6213 5.6154 1.0598 1.0797 1.0796 1.0961 1.0896 1.0885 1.0960 1.0971 1.1150 1.0763 1.0777
irintensity: 0.1300 0.3854 0.0586 0.1726 0.8347 0.2149 1.6474 1.2468 13.7506 0.2195 0.0119 1.2971 3.5383 3.8556 20.4345 7.9336 5.4753 1.5261 0.2329 4.3619 14.8110 12.3813 45.9959 8.4182 7.7510 19.0513 2.5148 29.0667 5.8952 9.3949 2.0958 2.9857 18.7854 165.5232 61.4290 7.8700 63.4453 2.8354 3.8231 4.2639 1.8559 71.5247 0.4317 6.2443 5.5396 18.7105 26.7056 12.3323 13.5755 17.4304 7.4264 61.5746 31.3775 20.0591 9.5123 46.6342 114.4941 14.9480 186.0606 214.9188 8.4167 1.1317 5.7115 2.1750 9.3784 30.0611 149.4153 0.3208 19.6678 245.8381 108.7162 8.8478 599.5123 10.6174 1.7146 5.8150 10.9872 0.1586 0.8440 1.9129 3.9546 21.4079 82.5961 56.9876
temp: 298.150 k
press: 1.00000 atm
elementType: 9 8 8 8 7 7 6 6 6 6 6 6 6 6 6 6 6 6 6 1 1 1 1 1 1 1 1 1 1 1
symmnumber: 1
zpe: 577024.4 jmol-1
zpe.correction: 0.219777 hartree
zpe.thermalcorrener: 0.236509 hartree
zpe.thermalcorrenthalpy: 0.237454 hartree
zpe.thermalcorrgfe: 0.174108 hartree
zpe.sumelectzpe: -935.669703 hartree
zpe.sumelectthermal: -935.652971 hartree
zpe.sumelectthermalent: -935.652027 hartree
zpe.sumelectthermalfe: -935.715372 hartree
dipole: 0.7208 -0.3581 0.0396
dipole: 0.8058
quadrupole: -117.3584 -115.9898 -111.2403
quadrupole: -3.3664 0.7742 5.5341
quadrupole: -2.4956 -1.1270 3.6225 -3.3664 0.7742 5.5341
hfenergy: -935.8894804 hartree
pointgroup: C01 [X(C13H11F1N2O3)]
dipole: -0.2747502 0.1573691 0.0162122 debye
polarizability: 186.3628664|-2.51223|147.4649282|5.9330269|-17.1076904|139.4615231 unknown
InChI: InChI=1S/C13H11FN2O3/c1-2-7-13(8-3-5-9(14)6-4-8)10(17)15-12(19)16-11(13)18/h2-6,15-16H,1,7H2
charge 0 multiplicity 1
30 atoms
F  5.127628 -0.453338 -0.082929
O  -1.00991 1.279547 -2.146704
O  -1.221929 -0.440751 2.34536
O  -2.669758 -2.96463 -1.269207
N  -1.747428 -0.855822 -1.684269
N  -1.8467 -1.700071 0.516992
C  -0.578825 0.434108 0.133002
C  -0.795402 1.893404 0.683841
C  0.956172 0.135747 0.063771
C  -1.135705 0.352266 -1.307139
C  -1.244881 -0.569944 1.09417
C  1.602528 -0.681018 1.027204
C  1.739236 0.762747 -0.942406
C  -2.254411 2.254717 0.886544
C  -2.115737 -1.921929 -0.846954
C  2.99915 -0.884871 0.982512
C  3.13498 0.570568 -0.99816
C  3.734931 -0.254655 -0.032611
C  -2.951285 3.101655 0.088049
H  -0.321568 2.584654 -0.033106
H  -0.251327 1.952794 1.64347
H  1.034299 -1.149348 1.83535
H  1.259432 1.400773 -1.690872
H  -2.016523 -0.950738 -2.669222
H  -2.198103 -2.418392 1.159209
H  -2.749336 1.795033 1.754599
H  3.507103 -1.512245 1.720301
H  3.745827 1.047391 -1.769868
H  -4.002922 3.339139 0.285519
H  -2.488435 3.576408 -0.785643
