program: Gaussian 09
title: 000252306
version: EM64L-G09RevD.01
frameworkgroup: C1[X(C14H9ClO2S)]
method: RPBEPBE
basis: SDD
operation: Freq
keyword: #p
keyword: freq=noraman
keyword: PBEPBE/SDD
title: #p freq=noraman PBEPBE/SDD
converged: YES YES NO NO
title: Mulliken charges:
elementType: Cl S O O C C C C C C C C C C C C C C H H H H H H H H H
charge: -0.057743 0.253952 -0.222322 -0.206716 -0.512953 0.473799 -0.297604 0.293051 0.182756 -0.360505 -0.369881 -0.261319 -0.337719 -0.212027 -0.229895 -0.082115 -0.196726 -0.228180 0.311767 0.265790 0.281542 0.253307 0.277298 0.240493 0.242298 0.238920 0.260733
chargesum: 0.00000
title: Mulliken charges with hydrogens summed into heavy atoms:
elementType: Cl S O O C C C C C C C C C C C C C C
charge: -0.057743 0.253952 -0.222322 -0.206716 -0.201186 0.473799 -0.297604 0.293051 0.182756 -0.094715 -0.088339 -0.008012 -0.060421 0.028466 0.012404 -0.082115 0.042193 0.032553
polarizability: 2.78539543e+02 7.59739437e+00 1.78905412e+02 1.63533011e+01 -1.44531175e-01 1.02022491e+02
1716.lowfreq: -12.4578 -5.7696 -3.5369 0.0015 0.0021 0.0031 12.5416 37.2230 62.7648
frequency: 12.3265 37.1952 62.7623 90.6603 121.6805 168.7137 184.2828 190.0964 229.7204 233.3318 280.1967 335.5522 364.6170 392.6882 402.7585 413.5307 431.3767 454.5274 488.5895 515.7074 537.8361 621.8422 631.2276 655.2144 669.6280 671.9998 687.5810 715.0421 744.2949 761.7914 785.0853 802.2488 864.6182 886.3589 889.8066 925.0640 963.6172 973.0210 975.9123 985.7002 992.0159 1000.7133 1030.5966 1065.4147 1074.1635 1095.2405 1125.1607 1175.6440 1178.5870 1196.1529 1205.6724 1228.6812 1266.1390 1293.6229 1314.8237 1376.4788 1383.6932 1420.4996 1425.1849 1450.4565 1467.4832 1566.6900 1579.8058 1596.5083 1609.6769 1648.6351 3025.5790 3137.8538 3148.4634 3150.5346 3153.7161 3160.3734 3173.3935 3174.8246 3185.6682
redmass: 7.5369 7.7965 6.6700 11.2206 4.7925 7.1015 5.7962 10.2671 5.8476 5.3291 7.1299 6.4603 11.1474 10.3231 9.9701 3.9475 3.2203 7.0661 3.9727 6.2844 7.4862 7.9709 6.8963 5.7717 5.6992 5.2051 4.6167 2.8075 2.4531 6.7563 1.7273 1.4657 4.2988 1.4061 1.5542 1.3825 7.7550 1.4415 6.4737 5.3885 1.3736 1.3578 3.4747 2.7759 2.1027 1.5645 1.8907 1.0765 1.0833 1.4488 2.2183 1.8397 1.4920 1.3846 1.4146 10.8489 7.7726 2.4724 2.2833 2.3271 2.5157 6.5342 6.5904 6.2834 6.6912 12.3325 1.0866 1.0863 1.0881 1.0898 1.0928 1.0952 1.0942 1.1007 1.0974
irintensity: 2.1268 0.7733 0.9949 1.5500 1.0546 0.4764 1.0374 0.1527 0.4378 1.7419 2.6836 0.9165 1.3529 2.2675 7.6779 2.9220 4.1096 2.1152 13.2263 3.2455 6.6835 12.9407 1.7085 14.1789 21.0746 4.4357 42.7644 67.5230 39.3893 6.0685 47.2651 26.4885 43.0531 0.5592 13.0483 0.5492 26.4125 6.0181 141.6372 15.7876 0.7175 0.5182 22.9807 114.4822 20.9482 3.2750 3.7711 4.0772 5.2911 16.1069 25.1465 197.7718 43.5456 6.4883 16.0521 5.6484 0.1373 44.8839 28.6706 28.7653 21.2984 11.8668 35.8656 69.7840 11.5843 302.7631 11.7964 2.1341 8.2498 4.3308 0.9085 6.3328 3.8215 21.1255 3.2274
temp: 298.150 k
press: 1.00000 atm
elementType: 17 16 8 8 6 6 6 6 6 6 6 6 6 6 6 6 6 6 1 1 1 1 1 1 1 1 1
symmnumber: 1
zpe: 497863.9 jmol-1
zpe.correction: 0.189626 hartree
zpe.thermalcorrener: 0.204584 hartree
zpe.thermalcorrenthalpy: 0.205528 hartree
zpe.thermalcorrgfe: 0.145089 hartree
zpe.sumelectzpe: -1546.216816 hartree
zpe.sumelectthermal: -1546.201859 hartree
zpe.sumelectthermalent: -1546.200914 hartree
zpe.sumelectthermalfe: -1546.261354 hartree
dipole: -1.4674 -2.7537 0.2393
dipole: 3.1294
quadrupole: -103.6657 -122.3531 -118.6414
quadrupole: 20.1846 5.9177 3.4219
quadrupole: 11.2210 -7.4664 -3.7547 20.1846 5.9177 3.4219
hfenergy: -1546.4064423 hartree
pointgroup: C01 [X(C14H9Cl1O2S1)]
dipole: -0.6533209 1.0432496 -0.0257562 debye
polarizability: 279.8545844|0.8419299|178.0310015|-11.5520574|4.9768387|101.5818608 unknown
InChI: InChI=1S/C14H9ClO2S/c15-10-5-3-4-9(8-10)14-17-13(16)11-6-1-2-7-12(11)18-14/h1-8,14H
charge 0 multiplicity 1
27 atoms
Cl 5.103055 2.063191 1.088239
S  -0.418033 1.136817 -1.058103
O  -0.23274 -1.428661 0.004933
O  -2.05701 -2.76002 0.321016
C  0.351909 -0.102363 0.190734
C  1.843741 -0.181628 -0.011268
C  -2.120672 0.865359 -0.446445
C  -2.510585 -0.384499 0.119825
C  -1.635742 -1.596433 0.175842
C  2.661993 0.825078 0.560383
C  2.426215 -1.225329 -0.769297
C  -3.065559 1.910049 -0.576565
C  -3.848835 -0.546564 0.574838
C  -4.389466 1.727006 -0.125642
C  -4.782071 0.498681 0.461212
C  4.050779 0.767496 0.352075
C  3.825251 -1.258948 -0.956999
C  4.655094 -0.259289 -0.399173
H  0.077041 0.288539 1.187108
H  2.224612 1.638224 1.148851
H  1.78401 -2.005362 -1.185694
H  -2.758989 2.865983 -1.013457
H  -4.131253 -1.51772 0.993808
H  -5.110782 2.545331 -0.224541
H  -5.808059 0.359723 0.815797
H  4.278806 -2.06815 -1.538473
H  5.739392 -0.280311 -0.540601
