program: Gaussian 09
title: 000252302
version: EM64L-G09RevD.01
frameworkgroup: C1[X(C10H11Cl3S)]
method: RPBEPBE
basis: SDD
operation: Freq
keyword: #p
keyword: freq=noraman
keyword: PBEPBE/SDD
title: #p freq=noraman PBEPBE/SDD
converged: YES YES NO NO
title: Mulliken charges:
elementType: Cl Cl Cl S C C C C C C C C C C H H H H H H H H H H H
charge: 0.104196 0.106683 0.109760 0.368734 -0.225602 0.581419 -0.701260 -0.686123 -0.474976 -0.373780 -0.161367 -0.241948 -0.241066 -0.681409 0.233135 0.201561 0.220024 0.231792 0.226513 0.219532 0.214195 0.236264 0.264386 0.231773 0.237567
chargesum: 0.00000
title: Mulliken charges with hydrogens summed into heavy atoms:
elementType: Cl Cl Cl S C C C C C C C C C C
charge: 0.104196 0.106683 0.109760 0.368734 0.007533 0.581419 -0.047882 -0.025884 -0.474976 -0.137516 0.103018 -0.010175 -0.003500 -0.681409
polarizability: 1.86048925e+02 8.67375858e+00 1.66417907e+02 1.61348460e+01 2.59078583e+00 1.11522748e+02
1716.lowfreq: -10.1456 -6.2774 -0.0008 0.0025 0.0040 4.6431 21.5360 32.0576 52.7723
frequency: 21.4406 31.8734 52.7694 60.2374 110.3553 143.2050 167.4012 186.8621 208.5622 220.5582 243.3115 254.1009 268.6157 283.1283 299.7199 330.4012 351.3508 388.9156 410.7954 471.9032 488.6510 548.6221 569.4025 626.9020 655.6099 672.2702 696.9432 748.1994 751.9203 770.4296 880.9095 893.0883 919.7821 958.3698 960.2505 996.3562 1012.4176 1030.9919 1068.4750 1103.8064 1118.2260 1159.8010 1177.4514 1214.1711 1272.3010 1306.5781 1325.9906 1376.3760 1379.8346 1397.5553 1424.8274 1454.9706 1465.8941 1467.4313 1482.6569 1487.4586 1570.7589 1597.0423 2974.1131 2979.6125 3018.8851 3068.3016 3077.4930 3077.8805 3086.2586 3129.0909 3144.5199 3156.0165 3172.3990
redmass: 8.8391 2.9346 6.3280 7.4834 3.6534 6.7262 8.3246 3.8756 1.7630 2.1876 1.2460 4.1152 7.0016 8.1931 9.3995 4.6575 3.2602 12.6955 9.2644 3.5528 4.1478 3.3312 3.2631 12.6634 6.0625 10.1407 10.2366 4.0917 3.7900 1.3040 1.4252 2.5021 1.1888 1.4341 1.3779 1.3434 6.8754 2.2391 1.5549 2.2334 2.2838 1.6313 1.0936 1.7959 1.7625 1.3083 1.8029 1.3123 2.6486 1.2165 2.0347 2.1496 1.0471 1.0695 1.0517 1.0925 5.8880 6.3035 1.0348 1.0361 1.0837 1.0998 1.0992 1.0998 1.1000 1.0856 1.0898 1.0947 1.0999
irintensity: 0.1452 0.0118 0.0450 0.2907 0.8303 0.9289 0.1169 1.0260 0.3949 0.1297 0.3416 0.1330 0.3281 0.2518 0.4933 1.9703 0.1270 4.4434 8.3278 1.7944 27.2867 3.5030 0.2483 178.1719 19.3283 118.3049 136.2526 2.4103 5.8670 87.4170 0.3732 2.9891 2.4283 0.1734 1.3562 0.1213 4.1899 19.1338 5.8403 7.2727 2.5540 1.5606 0.3313 8.1360 1.7904 0.9114 4.1046 14.3933 11.8195 10.6934 6.5903 15.3902 2.0576 6.4948 12.3029 18.2099 1.5742 4.0673 29.9969 30.1295 1.1003 2.0939 63.2197 30.6097 37.6012 2.2411 11.5196 20.1284 15.2367
temp: 298.150 k
press: 1.00000 atm
elementType: 17 17 17 16 6 6 6 6 6 6 6 6 6 6 1 1 1 1 1 1 1 1 1 1 1
symmnumber: 1
zpe: 475053.8 jmol-1
zpe.correction: 0.180938 hartree
zpe.thermalcorrener: 0.196709 hartree
zpe.thermalcorrenthalpy: 0.197653 hartree
zpe.thermalcorrgfe: 0.135720 hartree
zpe.sumelectzpe: -2164.833795 hartree
zpe.sumelectthermal: -2164.818024 hartree
zpe.sumelectthermalent: -2164.817080 hartree
zpe.sumelectthermalfe: -2164.879013 hartree
dipole: 3.2043 0.4973 -0.0183
dipole: 3.2427
quadrupole: -107.5202 -103.7120 -114.4548
quadrupole: 1.0188 3.1006 -0.1055
quadrupole: 1.0421 4.8504 -5.8925 1.0188 3.1006 -0.1055
hfenergy: -2165.0147333 hartree
pointgroup: C01 [X(C10H11Cl3S1)]
dipole: -1.2248375 0.3536101 -0.0486952 debye
dipolederiv: -0.4349155 -0.2272869 0.0897816 -0.402651 -0.6543363 0.1745731 0.2067877 0.1297131 -0.221933 -0.2585762 -0.0898013 -0.1708008 -0.062453 -0.3118613 -0.2516891 -0.0108752 -0.3447737 -0.6921093 -0.6562598 0.336094 -0.224416 0.3439896 -0.3716763 0.1825954 -0.1551304 0.1298579 -0.2398415 -0.1795338 -0.0616689 0.138894 -0.1209306 -0.0597588 -0.0944836 0.2112753 -0.0662443 -0.0998484 0.0384939 -0.1047449 -0.0148861 -0.0034517 0.0788849 0.0208157 -0.0040541 0.0658443 0.0962126 -0.028979 -0.0504989 -0.0333073 0.3224263 0.2405466 0.0071057 -0.0383817 -0.0869463 -0.0676497 0.068002 -0.0117754 0.0109098 -0.0538016 -0.0036512 -0.0291738 0.0061692 0.0036073 -0.0513645 0.0685693 0.000561 0.0387396 -0.0671076 -0.0183255 0.0132649 0.0178824 -0.064892 -0.016799 0.1841259 -0.092242 0.1254649 -0.0969496 -0.0241076 0.0167139 0.1384416 -0.0081364 -0.1221191 0.0014596 0.1731243 0.0782603 -0.0347328 -0.2420021 0.0057587 0.0862607 0.092237 -0.09329 -0.0567477 0.1184404 0.0440387 -0.1299954 -0.0396098 -0.0292247 -0.0604038 0.0600072 -0.0619229 0.0927328 -0.0422186 0.118472 0.0025943 0.1058029 -0.0307857 0.1120865 -0.0321369 -0.0635977 -0.2156676 -0.0170653 0.007385 0.0641462 0.0844999 0.0240948 -0.0255345 -0.0291529 -0.1537671 1.415012 0.0221185 0.0961767 0.1484182 1.2632334 -0.0374904 -0.1885535 0.0810975 1.2058976 -0.0556531 0.0724576 -0.0148857 0.0593736 0.0256661 -0.0073744 -0.0125665 0.0049004 0.0090194 -0.1300407 0.0585707 -0.0772024 0.1157964 0.0685384 0.0259138 -0.021096 -0.0063632 0.0620648 0.0856989 -0.0179666 -0.0147297 -0.0498802 -0.1960343 -0.0280235 -0.0182116 0.0074564 0.0783221 0.0115251 -0.0210656 0.1221279 -0.0292298 0.0866738 0.0582583 0.1038882 0.0422228 -0.0576662 0.0606713 -0.010279 -0.0897847 -0.0178189 0.0806436 -0.0820253 -0.0458896 -0.0577279 -0.1128003 0.0579778 -0.053393 0.0250246 -0.0794303 -0.2009961 0.0349093 0.0317159 0.0221411 0.0844057 -0.1041079 0.0668299 0.0091963 0.1191294 0.0468291 0.0196408 -0.0652835 0.0306764 0.0648396 -0.0463664 -0.0636853 -0.0762895 -0.0675497 0.0633388 -0.0332717 -0.0902621 -0.0203621 0.0970472 0.0120565 -0.0651101 -0.0740763 -0.0518417 0.0846316 -0.0019055 -0.0542995 -0.0095598 0.1057521 -0.0120348 0.097256 -0.0813323 0.0830203 0.01023 0.0446803 -0.0859548 0.0539098 0.1063103 0.0825572 -0.0166507 -0.0327607 0.0089296 -0.1171595 -0.0028773 -0.0380109 0.0026242 0.1448373 unknown
polarizability: 181.7948794|-10.9505057|169.0622244|19.0621327|-4.1277526|113.1324772 unknown
InChI: InChI=1S/C10H11Cl3S/c1-7(2)8-5-3-4-6-9(8)14-10(11,12)13/h3-7H,1-2H3
charge 0 multiplicity 1
25 atoms
Cl 3.235099 1.097415 -0.377165
Cl 1.877655 -1.351564 -1.495997
Cl 3.828777 -1.62586 0.82019
S  1.168681 -0.431381 1.413166
C  -1.50431 -1.600699 0.01399
C  -1.297169 -0.083263 0.002763
C  -1.995101 -2.150262 -1.348515
C  -2.480485 -1.994734 1.158139
C  -0.157237 0.55579 0.57134
C  -2.298621 0.767591 -0.539678
C  -0.026959 1.965773 0.604615
C  -2.173943 2.172052 -0.526585
C  -1.034217 2.780127 0.047941
C  2.484827 -0.559123 0.090535
H  -0.529173 -2.073243 0.232244
H  -3.0127 -1.795551 -1.596214
H  -2.030766 -3.254512 -1.31555
H  -1.317039 -1.851828 -2.16758
H  -2.10136 -1.663387 2.141805
H  -2.609781 -3.092173 1.190204
H  -3.475372 -1.536108 1.005189
H  -3.19215 0.315049 -0.983276
H  0.858367 2.414012 1.064812
H  -2.967057 2.792519 -0.958759
H  -0.931664 3.869962 0.067785
