program: Gaussian 09
title: 000252309
version: EM64L-G09RevD.01
frameworkgroup: C1[X(C15H12O4S)]
method: RPBEPBE
basis: SDD
operation: Freq
keyword: #p
keyword: freq=noraman
keyword: PBEPBE/SDD
title: #p freq=noraman PBEPBE/SDD
converged: YES YES NO NO
title: Mulliken charges:
elementType: S O O O O C C C C C C C C C C C C C C C H H H H H H H H H H H H
charge: 0.247961 -0.217117 -0.289859 -0.447786 -0.212656 -0.537133 0.520922 -0.301644 0.294383 -0.531979 -0.352223 0.180737 0.237953 -0.261935 -0.340320 -0.352228 0.180584 -0.213358 -0.231930 -0.519545 0.312890 0.262764 0.271611 0.252346 0.276022 0.220145 0.238409 0.240255 0.363724 0.264336 0.213238 0.231434
chargesum: 0.00000
title: Mulliken charges with hydrogens summed into heavy atoms:
elementType: S O O O O C C C C C C C C C C C C C C C
charge: 0.247961 -0.217117 -0.289859 -0.084062 -0.212656 -0.224243 0.520922 -0.301644 0.294383 -0.269216 -0.080612 0.180737 0.237953 -0.009589 -0.064298 -0.132084 0.180584 0.025052 0.008325 0.189463
polarizability: 3.14104082e+02 -9.79978625e+00 1.77069679e+02 1.59624073e+01 2.36993876e+00 1.22393147e+02
1716.lowfreq: -6.1601 -0.0013 0.0013 0.0017 3.9757 6.1497 16.3624 35.1216 51.5191
frequency: 16.1117 35.1154 51.5171 65.7596 91.5023 121.0571 128.5408 150.3492 171.9099 210.7211 218.2444 234.5866 270.5331 286.6653 326.8606 345.2070 360.0853 365.6077 391.8517 416.3348 418.5579 450.1305 465.0296 489.3078 521.0422 559.6230 583.6530 605.1417 634.5036 666.6818 670.7949 686.9064 721.1820 732.3208 743.0401 763.4600 778.7773 788.9275 807.1729 884.4640 888.0813 896.2595 938.4183 949.6134 972.2356 978.9404 999.2229 1000.8720 1030.5445 1065.6705 1078.3355 1113.9771 1124.3426 1153.6245 1161.5131 1167.4293 1174.8146 1199.5100 1221.1843 1231.1455 1264.9462 1267.6394 1290.7870 1312.5150 1376.2575 1398.4715 1412.6892 1424.1278 1443.7934 1449.9050 1457.8908 1479.5204 1503.9617 1566.0132 1596.6451 1598.7577 1616.7280 1643.7347 2979.8390 3030.0592 3090.6892 3113.3889 3132.5074 3136.7747 3149.7084 3149.8414 3159.8891 3173.9780 3181.4987 3578.6696
redmass: 5.5954 6.0511 5.6695 2.6180 8.2995 4.7240 2.5874 2.0879 6.2166 6.0317 3.4023 5.8202 5.5703 6.0664 4.5854 1.3029 4.0274 7.9931 9.8557 4.0533 6.2838 5.1851 3.9207 4.0026 7.5044 5.5990 6.3930 7.8159 6.3047 5.9017 5.1469 5.4344 4.8996 3.9123 2.5900 6.5626 2.5192 2.6042 1.5067 1.5643 2.6471 1.9130 1.3465 9.3128 1.3994 7.3807 1.5029 2.8179 3.4601 2.7566 2.2925 1.2388 1.9014 1.3339 1.2062 1.5601 1.0754 1.7552 1.8512 1.8455 1.5591 2.5996 1.6224 1.5947 10.8031 6.2223 2.1496 2.1430 1.4708 2.3345 1.0677 1.0563 3.1238 6.5416 6.3086 6.6944 6.7672 12.2306 1.0348 1.0870 1.0972 1.0902 1.1051 1.0861 1.0898 1.0919 1.0951 1.1007 1.0944 1.0660
irintensity: 2.8095 1.0836 4.6643 4.3701 2.0205 1.1184 1.7750 1.3642 2.5657 0.7967 1.1612 1.1375 7.5280 3.6174 9.5017 112.3224 17.8314 7.6138 2.0319 4.1898 3.7686 9.8346 1.0332 13.6643 4.3504 19.3566 4.2224 23.3306 8.1231 20.6899 16.7503 28.2753 15.1169 25.6719 44.7070 4.6259 15.3803 26.7267 24.3169 6.8332 16.5708 39.0445 0.9812 92.2365 4.3872 180.1475 4.1914 14.8278 23.9392 165.5719 120.3563 6.0542 4.6998 39.6159 39.4583 15.3935 3.8373 26.0611 45.9839 197.1071 5.5616 348.1351 6.1208 62.7948 5.2282 1.4151 22.6894 40.0969 20.1324 31.2305 13.7179 29.6820 97.6254 11.3505 68.2801 38.0494 23.7155 298.5187 87.3476 11.7512 36.4109 20.6318 14.4542 2.3791 4.8513 1.5722 7.3930 23.9408 0.5183 54.9962
temp: 298.150 k
press: 1.00000 atm
elementType: 16 8 8 8 8 6 6 6 6 6 6 6 6 6 6 6 6 6 6 6 1 1 1 1 1 1 1 1 1 1 1 1
symmnumber: 1
zpe: 613422.5 jmol-1
zpe.correction: 0.233640 hartree
zpe.thermalcorrener: 0.251497 hartree
zpe.thermalcorrenthalpy: 0.252441 hartree
zpe.thermalcorrgfe: 0.186194 hartree
zpe.sumelectzpe: -1276.313351 hartree
zpe.sumelectthermal: -1276.295494 hartree
zpe.sumelectthermalent: -1276.294550 hartree
zpe.sumelectthermalfe: -1276.360797 hartree
dipole: -1.3531 -1.8526 -0.1134
dipole: 2.2970
quadrupole: -89.6898 -128.9966 -119.6069
quadrupole: -23.7892 2.1955 -7.4414
quadrupole: 23.0746 -16.2322 -6.8425 -23.7892 2.1955 -7.4414
hfenergy: -1276.546991 hartree
pointgroup: C01 [X(C15H12O4S1)]
dipole: 0.4872593 0.7545234 -0.09965 debye
polarizability: 313.2513428|-3.0643986|175.9730807|-23.1355401|-5.6903371|124.342484 unknown
InChI: InChI=1S/C15H12O4S/c1-18-12-8-9(6-7-11(12)16)15-19-14(17)10-4-2-3-5-13(10)20-15/h2-8,15-16H,1H3
charge 0 multiplicity 1
32 atoms
S  -1.207579 0.918336 -1.336429
O  -0.837467 -1.373396 0.199101
O  4.135476 2.065972 0.356391
O  5.321596 -0.12331 -1.12091
O  -2.579144 -2.664256 0.906423
C  -0.293107 -0.018416 0.075543
C  1.178966 -0.095902 -0.212651
C  -2.848774 0.730167 -0.553295
C  -3.142877 -0.388488 0.28181
C  2.027364 0.948051 0.223988
C  1.727111 -1.186422 -0.92819
C  -2.215179 -1.540889 0.504767
C  3.410596 0.939756 -0.056916
C  -3.846007 1.700692 -0.811429
C  -4.435051 -0.490548 0.868365
C  3.106213 -1.208275 -1.211967
C  3.950509 -0.150229 -0.802228
C  -5.123051 1.578321 -0.225724
C  -5.418038 0.484722 0.625803
C  5.449896 1.862774 1.003769
H  -0.522127 0.558336 0.989354
H  1.637269 1.801923 0.788617
H  1.080729 -2.010972 -1.238359
H  -3.613653 2.556243 -1.453996
H  -4.643157 -1.364391 1.494185
H  3.53384 -2.051723 -1.770522
H  -5.883792 2.340421 -0.42692
H  -6.407542 0.393696 1.084598
H  5.56255 -0.907361 -1.674292
H  6.171842 1.411986 0.305111
H  5.341854 1.223083 1.900729
H  5.770829 2.872496 1.301073
