program: Gaussian 09
title: 000252281
version: EM64L-G09RevD.01
frameworkgroup: C1[X(C14H9NO3)]
method: RPBEPBE
basis: SDD
operation: Freq
keyword: #p
keyword: freq=noraman
keyword: PBEPBE/SDD
title: #p freq=noraman PBEPBE/SDD
converged: YES YES NO NO
title: Mulliken charges:
elementType: O O O N C C C C C C C C C C C C C C H H H H H H H H H
charge: -0.188132 -0.185311 -0.429326 -0.361318 0.181438 0.181038 0.063450 0.063936 0.494255 -0.350962 -0.350647 -0.320025 -0.323421 -0.211799 -0.211794 -0.386082 -0.351700 0.290183 0.270889 0.271253 0.269618 0.271434 0.239648 0.239756 0.223292 0.254792 0.355534
chargesum: 0.00000
title: Mulliken charges with hydrogens summed into heavy atoms:
elementType: O O O N C C C C C C C C C C C C C C
charge: -0.188132 -0.185311 -0.073792 -0.361318 0.181438 0.181038 0.063450 0.063936 0.494255 -0.080073 -0.079394 -0.050407 -0.051987 0.027850 0.027962 -0.162790 -0.096908 0.290183
polarizability: 2.88196048e+02 -2.03803126e+00 1.67456917e+02 -1.08868573e+00 5.16944204e+00 7.35096610e+01
1716.lowfreq: -5.0584 -3.2591 -2.7169 -0.0009 -0.0007 -0.0006 41.7460 44.3252 75.8628
frequency: 41.7343 44.3204 75.8604 134.2950 143.4509 168.4121 215.9197 246.7799 249.6253 317.3498 346.6645 363.8706 379.6935 405.2226 409.2570 436.9220 453.2933 516.4832 524.2310 530.4774 575.1023 632.2405 656.3553 675.3920 690.4212 707.6064 719.5663 782.5016 787.2432 793.4089 799.0026 826.9368 839.6564 863.1827 905.2776 927.1539 953.3291 973.3577 1002.2059 1006.2584 1010.0639 1036.1373 1077.2868 1094.6388 1115.9222 1146.9095 1172.6273 1172.9557 1186.9506 1229.6349 1252.9366 1282.7390 1320.5299 1337.9370 1391.7396 1417.4117 1434.1573 1453.3477 1457.3932 1506.8880 1595.9255 1615.7276 1618.4281 1626.8696 1630.1556 1676.1415 3123.4875 3140.4629 3154.1527 3165.8762 3168.7205 3175.4331 3189.2379 3193.4047 3582.9072
redmass: 7.2023 4.0803 6.9674 5.0502 7.3269 7.7713 6.3416 8.4548 7.3133 6.8880 10.6232 1.1151 4.9544 3.3141 2.9595 4.6023 4.8841 2.5739 6.8459 8.7150 10.7787 6.9385 4.8031 7.2063 5.8882 3.5677 3.6556 5.3931 6.2480 1.5594 1.3653 1.6396 6.6325 6.6640 1.3925 1.3716 1.3606 1.4113 3.0328 1.3481 2.2321 7.3429 2.6695 3.2874 1.4707 1.3209 1.1182 2.0593 1.1164 3.3276 2.7053 1.5014 1.3497 7.2571 6.0109 6.6300 3.3040 2.4536 2.7564 2.7244 6.6743 7.8823 7.8239 9.1305 7.4943 12.8104 1.0908 1.0865 1.0906 1.0956 1.0896 1.1004 1.0943 1.0965 1.0661
irintensity: 2.5807 1.2303 1.9575 0.0813 1.9973 1.4150 1.1912 1.7213 0.9638 3.9040 10.3798 146.7160 3.5059 6.1472 0.1792 4.7581 0.0073 29.3863 15.5266 18.4954 20.7710 2.0512 0.1639 1.8444 3.5875 43.9815 14.5810 0.0011 5.0040 64.4876 6.3448 53.6536 26.8894 19.7665 0.0720 4.4185 1.5403 2.0635 0.8278 0.0618 8.5411 98.0859 2.7790 49.1478 84.5351 241.7344 9.7893 3.1277 18.2040 46.1491 107.9610 0.4100 3.7857 241.7009 32.1689 29.1319 17.8977 11.2328 2.0400 217.2602 30.2005 81.3201 0.6983 244.6032 118.0433 17.3319 20.9924 1.9059 6.0379 5.2248 5.6711 21.9309 1.1629 0.4359 57.4846
temp: 298.150 k
press: 1.00000 atm
elementType: 8 8 8 7 6 6 6 6 6 6 6 6 6 6 6 6 6 6 1 1 1 1 1 1 1 1 1
symmnumber: 1
zpe: 513647.8 jmol-1
zpe.correction: 0.195638 hartree
zpe.thermalcorrener: 0.209628 hartree
zpe.thermalcorrenthalpy: 0.210572 hartree
zpe.thermalcorrgfe: 0.154272 hartree
zpe.sumelectzpe: -818.111183 hartree
zpe.sumelectthermal: -818.097193 hartree
zpe.sumelectthermalent: -818.096249 hartree
zpe.sumelectthermalfe: -818.152549 hartree
dipole: 2.6094 1.3958 0.7203
dipole: 3.0456
quadrupole: -72.5533 -106.7388 -104.8784
quadrupole: -9.2867 -4.8068 6.0975
quadrupole: 22.1702 -12.0153 -10.1549 -9.2867 -4.8068 6.0975
hfenergy: -818.3068214 hartree
pointgroup: C01 [X(C14H9N1O3)]
dipole: 1.0292274 0.5441266 0.2835724 debye
polarizability: 288.1740552|-2.5469751|167.4535161|-1.2850389|5.3818152|73.5350543 unknown
InChI: InChI=1S/C14H9NO3/c16-10-7-5-9(6-8-10)15-13(17)11-3-1-2-4-12(11)14(15)18/h1-8,16H
charge 0 multiplicity 1
27 atoms
O  0.391743 2.35021 -0.330356
O  0.379633 -2.339766 0.343185
O  -5.682629 -0.044398 -0.036068
N  -0.01671 0.005971 0.003517
C  2.22068 0.698905 -0.099741
C  2.217065 -0.700031 0.099167
C  0.806524 1.17798 -0.165132
C  0.800443 -1.171367 0.169354
C  -1.455551 0.010149 0.004747
C  3.418242 1.421914 -0.205097
C  3.410751 -1.429769 0.201603
C  -2.162563 1.097665 0.573139
C  -2.172474 -1.074018 -0.565427
C  4.63298 0.694661 -0.103967
C  4.629306 -0.709424 0.097042
C  -3.571466 1.105101 0.565944
C  -3.578423 -1.073019 -0.561405
C  -4.280022 0.017672 0.001189
H  3.406708 2.505265 -0.359543
H  3.39338 -2.513038 0.356065
H  -1.6187 1.941106 1.003165
H  -1.634212 -1.920908 -0.995963
H  5.589141 1.223038 -0.181754
H  5.582667 -1.24322 0.172068
H  -4.110382 1.955547 1.002431
H  -4.144461 -1.903558 -0.99197
H  -6.08397 0.758428 0.379907
