program: Gaussian 09
title: 000252286
version: EM64L-G09RevD.01
frameworkgroup: C1[X(C15H15ClN2O)]
method: RPBEPBE
basis: SDD
operation: Freq
keyword: #p
keyword: freq=noraman
keyword: PBEPBE/SDD
title: #p freq=noraman PBEPBE/SDD
converged: YES YES NO NO
title: Mulliken charges:
elementType: Cl O N N C C C C C C C C C C C C C C C H H H H H H H H H H H H H H H
charge: -0.069756 -0.267155 -0.261659 -0.170787 0.089741 0.175465 0.276922 0.159066 0.121090 -0.332013 -0.200652 -0.168917 -0.818424 -0.353896 -0.362385 -0.405146 -0.226514 -0.246381 -0.585522 0.202002 0.279579 0.240085 0.238694 0.275912 0.216498 0.227076 0.225171 0.291577 0.232860 0.242839 0.224142 0.224725 0.253808 0.271953
chargesum: 0.00000
title: Mulliken charges with hydrogens summed into heavy atoms:
elementType: Cl O N N C C C C C C C C C C C C C C C
charge: -0.069756 -0.267155 -0.261659 -0.170787 0.089741 0.175465 0.276922 0.159066 0.121090 0.149569 0.039433 0.069777 -0.074600 0.138514 -0.129526 -0.162307 -0.002371 -0.021656 -0.059761
polarizability: 3.15167554e+02 -3.61522853e-01 1.98114522e+02 -1.55630871e+01 -1.11444611e+00 9.52128669e+01
1716.lowfreq: -5.5625 -2.0422 -0.0003 0.0015 0.0022 6.5061 23.9856 32.1844 41.4048
frequency: 23.9212 32.1715 41.2379 87.1922 96.8795 112.7655 119.2889 152.5928 167.7884 186.9442 218.7227 240.4225 282.4633 315.7736 326.4573 346.7323 358.9923 390.1177 437.5615 481.7736 534.1157 539.7911 562.6833 576.9791 584.6094 603.4563 617.6379 621.1772 662.5825 700.2852 736.0454 743.5493 754.8652 759.6815 772.3899 794.6147 848.3423 853.5391 854.0280 923.9112 938.4572 946.9532 976.5609 981.2913 1010.3589 1027.2497 1037.6759 1045.0640 1073.4786 1088.2127 1106.2519 1130.1144 1162.3774 1168.2443 1191.2183 1198.5203 1242.4024 1255.6194 1264.6810 1295.5615 1318.6002 1324.3766 1341.9489 1366.4913 1370.9909 1378.7684 1397.5696 1411.4964 1431.1096 1448.5927 1454.7538 1458.4633 1464.3635 1467.4372 1480.0109 1485.9104 1559.3078 1575.5409 1589.3227 1619.1042 1660.8398 2971.0762 2973.1006 3011.7461 3039.7100 3046.0045 3064.9857 3098.8724 3111.4635 3127.9710 3130.4449 3136.8147 3149.9719 3165.5489 3189.0124 3223.1097
redmass: 7.2800 8.0202 3.4455 4.3066 6.1561 3.8357 1.2463 3.0334 4.1066 4.1029 2.3924 2.6356 5.7769 4.1440 3.4752 4.7388 4.4032 4.9278 3.0946 4.8376 4.6292 5.0393 4.9769 5.5650 4.2798 4.5949 4.7841 4.5068 5.6718 1.3962 3.4776 3.3594 1.9250 3.1853 2.2725 2.4080 1.2949 1.5373 1.4412 5.1234 1.3737 3.0653 1.3085 2.3426 2.1404 1.8256 3.6802 1.4634 2.0284 2.3308 1.9584 1.5896 1.3500 1.2109 2.6315 1.3231 2.1012 1.8500 2.1193 1.1886 1.3710 1.9491 1.6113 1.8873 1.7922 2.7923 1.3915 2.6128 3.5686 1.1569 1.1046 1.7929 1.2239 1.6986 2.5718 1.0543 7.6311 6.5669 7.8575 7.3915 7.0110 1.0391 1.0657 1.0645 1.0971 1.0610 1.0897 1.1013 1.0969 1.0849 1.1102 1.0890 1.0956 1.1002 1.0890 1.1001
irintensity: 0.3662 0.1606 2.2060 2.4170 4.9133 0.7283 0.0774 1.4256 1.3953 1.3949 1.1197 1.6014 0.1077 4.5349 6.4761 6.1792 2.8785 11.9244 11.7137 3.1444 1.0217 1.6890 1.8146 1.5237 0.7481 23.3785 2.2784 2.7557 1.9248 50.0616 17.4718 45.4469 51.2806 11.7316 6.9415 12.2490 0.1450 3.8893 3.0746 16.0007 2.0151 31.8761 0.0093 16.8787 8.4533 2.5691 9.0542 2.0397 22.4443 1.2433 1.2934 4.0277 16.5678 2.2800 27.9105 1.9361 3.4307 87.9926 67.5911 22.2517 5.4914 42.9815 31.1929 25.5391 37.2916 17.9582 42.8519 7.0407 54.9930 6.6606 8.1962 29.1288 7.8095 136.3286 18.5315 15.6599 68.9732 3.5130 233.8264 14.2700 42.0651 41.8059 14.5519 41.3560 21.9096 24.4995 11.3523 3.0268 0.6702 0.0107 16.1137 3.4695 27.6111 34.3955 3.3323 4.9485
temp: 298.150 k
press: 1.00000 atm
elementType: 17 8 7 7 6 6 6 6 6 6 6 6 6 6 6 6 6 6 6 1 1 1 1 1 1 1 1 1 1 1 1 1 1 1
symmnumber: 1
zpe: 703698.5 jmol-1
zpe.correction: 0.268025 hartree
zpe.thermalcorrener: 0.285095 hartree
zpe.thermalcorrenthalpy: 0.286039 hartree
zpe.thermalcorrgfe: 0.221429 hartree
zpe.sumelectzpe: -1224.050824 hartree
zpe.sumelectthermal: -1224.033754 hartree
zpe.sumelectthermalent: -1224.032810 hartree
zpe.sumelectthermalfe: -1224.097420 hartree
dipole: -1.2881 -5.1843 1.1214
dipole: 5.4584
quadrupole: -118.5211 -108.5126 -121.0028
quadrupole: -13.7678 4.5849 0.9741
quadrupole: -2.5089 7.4995 -4.9906 -13.7678 4.5849 0.9741
hfenergy: -1224.3188488 hartree
pointgroup: C01 [X(C15H15Cl1N2O1)]
dipole: -0.4733826 2.0478066 -0.4406246 debye
polarizability: 315.1359379|-1.5455043|198.1346712|15.6302688|-1.3298813|95.2243347 unknown
InChI: InChI=1S/C15H15ClN2O/c1-11-12-5-2-3-6-13(12)18-10-9-17(8-4-7-16)15(19)14(11)18/h2-3,5-6,9-10H,4,7-8H2,1H3
charge 0 multiplicity 1
34 atoms
Cl 6.36628 -0.770752 0.17153
O  1.774596 -1.748531 0.270406
N  -0.87655 0.822102 0.151096
N  1.887537 0.587356 0.412118
C  -0.290793 -0.486977 0.155468
C  -1.302362 -1.452385 0.024233
C  -2.263072 0.686425 0.01758
C  -2.550339 -0.723127 -0.061901
C  1.162484 -0.632525 0.278442
C  3.363322 0.503952 0.515786
C  -0.096906 1.977355 0.269779
C  1.259456 1.848021 0.393671
C  -1.142655 -2.948337 -0.017302
C  4.037102 0.466637 -0.875724
C  -3.274434 1.671589 -0.037932
C  -3.902475 -1.141334 -0.200575
C  -4.60267 1.226471 -0.17535
C  -4.913982 -0.16674 -0.255686
C  5.554838 0.627257 -0.821964
H  3.719736 1.373081 1.099886
H  3.615862 -0.417604 1.064735
H  -0.599764 2.942915 0.265643
H  1.905953 2.720107 0.498376
H  3.768831 -0.477739 -1.381157
H  3.645056 1.298541 -1.498563
H  -1.685732 -3.429289 0.819142
H  -1.55676 -3.366485 -0.955068
H  -0.080133 -3.226454 0.051338
H  -3.048746 2.741552 0.023082
H  -4.149324 -2.206697 -0.262842
H  -5.414553 1.960631 -0.221322
H  -5.960628 -0.472346 -0.361883
H  5.868858 1.552895 -0.3133
H  6.013265 0.566034 -1.820045
