program: Gaussian 09
title: 000252263
version: EM64L-G09RevD.01
frameworkgroup: C1[X(C5H5ClN4O2)]
method: RPBEPBE
basis: SDD
operation: Freq
keyword: #p
keyword: freq=noraman
keyword: PBEPBE/SDD
title: #p freq=noraman PBEPBE/SDD
converged: YES YES NO NO
title: Mulliken charges:
elementType: Cl O O N N N N C C C C C H H H H H
charge: 0.049288 -0.216743 -0.239640 -0.191510 -0.302876 0.019423 0.068188 0.360015 -0.134202 0.048809 -0.646734 -0.222476 0.238313 0.264513 0.298932 0.350084 0.256618
chargesum: 0.00000
title: Mulliken charges with hydrogens summed into heavy atoms:
elementType: Cl O O N N N N C C C C C
charge: 0.049288 -0.216743 -0.239640 -0.191510 0.047207 0.019423 0.068188 0.360015 -0.134202 0.048809 0.155024 0.034142
polarizability: 1.37519517e+02 -1.08266311e+00 1.20481347e+02 -2.05575197e+00 -2.57775215e+00 5.50905479e+01
1716.lowfreq: -7.0268 -2.8403 -0.0008 -0.0008 -0.0005 9.7393 55.4291 67.7465 103.4215
frequency: 55.4137 67.7412 103.3851 121.7572 149.6286 155.6025 244.2088 284.9483 327.8091 360.9391 367.9949 389.6702 423.5788 526.2815 535.3748 562.9812 588.5569 601.0639 706.8322 759.9916 782.0397 797.1636 896.6062 927.6401 979.3917 1063.9356 1092.6160 1108.5840 1155.9292 1233.4760 1316.1359 1366.3583 1369.1341 1408.1099 1431.3060 1472.4441 1476.2513 1556.6317 1591.2732 1610.1353 2991.2892 3090.2045 3113.5100 3146.4004 3537.3620
redmass: 7.3486 6.5062 1.1484 4.0891 9.2550 8.3471 8.1216 7.7592 5.3939 8.8000 4.6700 7.3918 9.2914 5.0003 6.3895 9.2261 10.3640 1.1722 6.5031 10.9390 6.0293 8.0689 1.4441 5.5328 7.0862 7.3549 3.4926 1.3829 1.9552 2.4787 4.4662 1.4353 4.2935 1.4577 2.5653 1.0834 1.0528 3.9548 10.0216 9.6287 1.0322 1.1003 1.1019 1.0936 1.0796
irintensity: 0.6872 7.8365 2.1229 2.9385 5.4098 4.5163 8.7576 5.7723 4.4441 0.4343 5.8799 3.8854 7.1360 2.9559 6.6386 8.5299 1.2566 111.1528 23.6092 15.3748 9.9673 136.2967 12.2115 122.9394 94.9689 35.6193 19.8685 5.4391 38.0566 42.1459 41.9013 24.8486 189.3155 59.1236 270.9258 2.1831 34.1625 105.8669 157.3297 188.8432 24.7922 6.2383 2.2578 10.0892 95.4156
temp: 298.150 k
press: 1.00000 atm
elementType: 17 8 8 7 7 7 7 6 6 6 6 6 1 1 1 1 1
symmnumber: 1
zpe: 286192.7 jmol-1
zpe.correction: 0.109005 hartree
zpe.thermalcorrener: 0.120372 hartree
zpe.thermalcorrenthalpy: 0.121316 hartree
zpe.thermalcorrgfe: 0.070807 hartree
zpe.sumelectzpe: -1022.074997 hartree
zpe.sumelectthermal: -1022.063630 hartree
zpe.sumelectthermalent: -1022.062686 hartree
zpe.sumelectthermalfe: -1022.113195 hartree
dipole: -4.1183 5.0106 2.3119
dipole: 6.8856
quadrupole: -73.8015 -82.9945 -75.6229
quadrupole: -16.5966 6.4574 -2.0607
quadrupole: 3.6714 -5.5215 1.8500 -16.5966 6.4574 -2.0607
hfenergy: -1022.184002 hartree
pointgroup: C01 [X(C5H5Cl1N4O2)]
dipole: -1.8350337 1.9724782 0.2839024 debye
dipolederiv: -0.1213878 -0.2023139 0.0029497 -0.1236852 -0.7291437 0.1331466 0.0234748 0.1192796 -0.0082162 -0.5294466 0.2994879 -0.1258115 0.1410121 -1.0595637 0.2220365 -0.0923786 0.2267131 -0.4113381 -1.4077771 -0.1417832 0.5923545 -0.0464765 -0.1801929 0.0396341 -0.0798551 -0.0138407 -0.2086268 -0.9015799 -0.0064216 0.1375816 -0.2621672 -0.2050286 0.1013509 0.7141778 0.0765408 -0.4502161 -0.9640834 -0.0446239 -0.0555759 -0.2229785 -0.8725205 0.1515821 -0.0650841 0.1803981 -0.2070663 -0.6050277 0.4084252 -0.1542287 0.0052603 -0.5961762 0.1162003 -0.0170229 0.172997 -0.3183469 1.4636072 0.2085989 -0.845102 0.4474879 0.0139859 -0.2088306 -0.826191 -0.0726932 0.4523287 0.6824212 -0.2708897 0.0190511 -0.0559434 -0.7397552 0.292915 0.0553594 0.2011734 -0.1280102 0.7642885 0.0135987 0.1245906 0.1850076 1.3003454 -0.2457094 -0.0070661 -0.2866628 0.0503214 0.7719719 -0.1692346 0.1415034 -0.1936421 1.4167901 -0.3782483 0.1507116 -0.3757575 0.3712595 -0.0505484 -0.0493788 0.1562684 -0.124045 0.1305514 0.0533247 0.138561 0.0774879 0.1390762 0.4052679 -0.0293129 0.0571422 0.2869338 1.0334927 -0.2637159 -0.0021944 -0.2842393 0.1076158 0.103537 0.0616179 0.0021723 0.0099479 -0.0039674 -0.1124863 -0.0334871 -0.0496388 -0.0629654 -0.0148459 0.0392504 -0.0412368 -0.0363604 0.1511264 -0.0086528 0.0754992 -0.0177879 0.1187371 0.222723 -0.0941294 0.0202028 -0.0136431 0.0381871 0.0517643 0.0374546 -0.0033227 0.0828589 0.2297638 -0.0540329 0.0017809 -0.0605183 0.2238556 0.0317091 -0.0113783 0.0309949 0.3412149 -0.0488835 0.031142 -0.0336426 0.0638103 0.0780136 0.0239799 -0.0605807 0.018358 0.1313735 unknown
polarizability: 137.5878185|0.5711873|112.4702297|-0.8223795|-21.5784224|63.0333629 unknown
InChI: InChI=1S/C5H5ClN4O2/c1-10(9-12)3-4(6)7-2-8-5(3)11/h2,7H,1H3
charge 0 multiplicity 1
17 atoms
Cl -0.055065 2.857121 -0.430929
O  -0.229853 -2.248662 0.821235
O  3.304501 0.521439 -0.779994
N  1.353987 0.084151 0.296409
N  -2.144676 1.16283 -0.334161
N  -2.238064 -1.146822 0.29987
N  2.037298 0.524632 -0.883404
C  -0.057603 0.087719 0.204163
C  -0.764227 1.218218 -0.1655
C  -0.813838 -1.188122 0.469979
C  2.06917 -0.415471 1.487933
C  -2.817219 -0.035064 -0.089819
H  1.943171 0.284962 2.332782
H  3.137486 -0.475349 1.220014
H  1.68011 -1.411017 1.753551
H  -2.653672 1.998868 -0.630829
H  -3.900808 -0.006034 -0.249297
