program: Gaussian 09
title: 000252262
version: EM64L-G09RevD.01
frameworkgroup: C1[X(C5H4Cl2N4O)]
method: RPBEPBE
basis: SDD
operation: Freq
keyword: #p
keyword: freq=noraman
keyword: PBEPBE/SDD
title: #p freq=noraman PBEPBE/SDD
converged: NO NO NO NO
title: Mulliken charges:
elementType: Cl Cl O N N N N C C C C C H H H H
charge: 0.049462 0.049486 -0.229585 -0.201883 0.073653 0.073658 0.076490 0.516430 -0.628985 -0.250175 -0.250464 -0.325352 0.231770 0.272033 0.272218 0.271244
chargesum: 0.00000
title: Mulliken charges with hydrogens summed into heavy atoms:
elementType: Cl Cl O N N N N C C C C C
charge: 0.049462 0.049486 -0.229585 -0.201883 0.073653 0.073658 0.076490 0.516430 0.147037 -0.250175 -0.250464 -0.054108
polarizability: 1.37613440e+02 -2.98094206e-01 1.22014624e+02 -1.27773479e+00 1.85948008e-02 6.03387376e+01
1716.lowfreq: -43.9207 -32.2767 -4.7077 -0.0021 -0.0018 0.0011 5.8157 7.8450 58.7864
frequency: -43.8634 -31.6373 58.7845 78.1980 137.1348 180.0799 186.4558 268.9545 270.7062 333.9450 366.2599 374.7511 390.3775 455.3267 515.4636 571.9023 575.9748 706.9851 757.0233 765.9797 782.6374 849.5918 931.7276 1008.0992 1099.2688 1118.4728 1142.6001 1179.3724 1211.7536 1239.4465 1345.0256 1375.8423 1387.6369 1428.8430 1433.2874 1443.6737 1472.6478 1526.2845 2998.9547 3085.5095 3136.4593 3194.0739
redmass: 3.3641 1.1566 11.4333 6.2042 8.7225 12.6382 14.5634 12.3774 4.4789 12.1703 4.3526 6.8715 14.8552 11.2201 8.8738 5.0548 12.4158 7.5919 12.3604 9.6517 5.6153 5.3805 1.4636 7.2746 1.3181 2.5529 7.4673 3.9994 4.8753 12.3284 10.8483 1.5520 3.3069 1.4247 4.7775 1.0557 1.1688 8.1926 1.0330 1.1012 1.1018 1.0938
irintensity: 3.7460 0.3043 0.3466 0.0794 3.8245 0.9255 0.0135 0.0690 3.1099 4.0253 3.5619 2.9288 8.1245 0.1580 3.2927 6.4426 0.1785 26.0450 125.1741 29.0711 38.8212 114.1929 9.0005 117.5909 0.1709 52.1827 11.7833 46.0017 19.8964 5.2276 211.1777 143.2415 68.2269 44.4689 183.8158 32.9977 63.4056 37.6435 8.7113 6.9126 4.9395 4.5599
temp: 298.150 k
press: 1.00000 atm
elementType: 17 17 8 7 7 7 7 6 6 6 6 6 1 1 1 1
symmnumber: 1
zpe: 247540.3 jmol-1
zpe.correction: 0.094283 hartree
zpe.thermalcorrener: 0.104363 hartree
zpe.thermalcorrenthalpy: 0.105307 hartree
zpe.thermalcorrgfe: 0.057265 hartree
zpe.sumelectzpe: -1406.310112 hartree
zpe.sumelectthermal: -1406.300032 hartree
zpe.sumelectthermalent: -1406.299088 hartree
zpe.sumelectthermalfe: -1406.347130 hartree
dipole: -1.3663 0.0179 3.0610
dipole: 3.3522
quadrupole: -87.0053 -88.5466 -81.3330
quadrupole: -0.0688 7.8675 -0.1704
quadrupole: -1.3770 -2.9183 4.2953 -0.0688 7.8675 -0.1704
hfenergy: -1406.4043949 hartree
pointgroup: C01 [X(C5H4Cl2N4O1)]
dipole: 0.594663 -0.0031872 -1.17717 debye
dipolederiv: -0.1984452 0.3355145 -0.0410337 0.2497035 -0.7034018 0.050637 -0.0320118 0.0701575 -0.0460011 -0.1981897 -0.334948 -0.0412639 -0.2495347 -0.7039639 -0.0514521 -0.0321679 -0.0708848 -0.0462384 -1.2733359 0.001368 0.5315084 0.0002051 -0.1707765 -0.000148 -0.1633882 0.0000267 -0.1888455 -1.019628 0.0005633 0.2350665 0.0019757 -0.1760113 -0.0016393 0.6439137 -0.000868 -0.4664312 -0.8597145 0.424641 -0.1159065 0.0508535 -0.6113465 0.0281063 -0.1239107 0.0777274 -0.146534 -0.8591419 -0.424745 -0.1163623 -0.0508911 -0.6116588 -0.0288791 -0.1237666 -0.078653 -0.1466636 1.5556052 -0.0020806 -0.8249662 -0.0045441 -0.0277705 0.001577 -0.8933037 0.001223 0.4461205 0.7290277 0.0004445 -0.0297807 0.0014499 -0.7513273 -0.0008804 0.2435821 -0.0009465 -0.0066759 0.103972 -0.0002452 0.0253439 -0.0001567 0.2068155 0.0002287 0.1648589 -0.0009263 0.1683231 0.6353181 -0.4536018 0.1418003 -0.3630834 1.346507 -0.0920507 0.0640891 -0.100701 0.0733135 0.6345306 0.4529324 0.1422795 0.3628271 1.3469828 0.0936922 0.0659287 0.1026532 0.0737107 0.6747289 -0.0000731 0.1031986 -0.0002576 0.6993439 0.0005267 0.1083392 0.0005523 0.0243608 0.014386 0.0013322 0.1050499 0.001243 0.1115194 -0.0009998 0.0865461 -0.0004305 0.0294295 0.0360217 0.0586748 -0.0470984 0.0655556 -0.0190314 0.0326728 0.0013068 -0.031811 0.051969 0.0350066 -0.0597556 -0.0467391 -0.0653099 -0.0170663 -0.0313499 0.0022507 0.0329316 0.0525511 -0.0101416 -0.0000215 -0.0210963 -0.0000358 0.0811857 -0.0000415 -0.0122664 -0.0000506 0.1276115 unknown
polarizability: 137.5639873|-0.0407395|122.0089259|2.4257885|0.0765395|60.3938889 unknown
InChI: InChI=1S/C5H4Cl2N4O/c1-11(10-12)3-4(6)8-2-9-5(3)7/h2H,1H3
charge 0 multiplicity 1
16 atoms
Cl 0.016549 2.786991 -0.16624
Cl 0.019575 -2.787098 -0.16954
O  -3.339248 0.002823 0.685104
N  -1.319304 -0.000774 -0.287524
N  2.189148 1.211946 0.176462
N  2.190531 -1.210108 0.174774
N  -2.082942 0.003261 0.908054
C  0.089986 -0.000056 -0.12371
C  -1.979089 -0.004171 -1.611531
C  0.859267 1.194461 -0.018558
C  0.860624 -1.193815 -0.02005
C  2.80801 0.001212 0.272487
H  -1.207152 -0.012295 -2.394876
H  -2.614961 0.892603 -1.715482
H  -2.624001 -0.895488 -1.705768
H  3.887505 0.001709 0.439597
