program: Gaussian 09
title: 000252279
version: EM64L-G09RevD.01
frameworkgroup: C1[X(C10H16N6O2S2)]
method: RPBEPBE
basis: SDD
operation: Freq
keyword: #p
keyword: freq=noraman
keyword: PBEPBE/SDD
title: #p freq=noraman PBEPBE/SDD
converged: YES YES NO NO
title: Mulliken charges:
elementType: S S O O N N N N N N C C C C C C C C C C H H H H H H H H H H H H H H H H
charge: 0.162134 0.162119 -0.312795 -0.312793 -0.370845 -0.370865 -0.088591 -0.088622 -0.645590 -0.645583 -0.336552 -0.336673 -0.622668 -0.622566 -0.235255 -0.235231 -0.139666 -0.139638 0.292816 0.292802 0.224693 0.274983 0.224707 0.274998 0.335628 0.267173 0.267188 0.335609 0.292131 0.292141 0.261201 0.261199 0.340618 0.300581 0.340624 0.300588
chargesum: 0.00000
title: Mulliken charges with hydrogens summed into heavy atoms:
elementType: S S O O N N N N N N C C C C C C C C C C
charge: 0.162134 0.162119 -0.312795 -0.312793 -0.078714 -0.078724 -0.088591 -0.088622 -0.004390 -0.004370 0.163123 0.163033 -0.019866 -0.019768 -0.235255 -0.235231 0.121535 0.121561 0.292816 0.292802
polarizability: 2.43667366e+02 6.46187928e-02 1.93955177e+02 4.19794130e+01 -2.38125419e-02 1.71252693e+02
1716.lowfreq: -12.6975 -8.9340 -0.0014 0.0003 0.0005 3.3872 7.3521 8.6938 11.0292
frequency: -4.7099 5.2330 9.2369 26.8398 30.6829 38.4140 61.9244 62.6405 81.9702 88.3274 96.5369 130.8822 175.4457 189.4156 214.5419 251.9899 268.7676 273.7080 281.0279 297.5532 307.9412 360.8061 372.2171 378.5308 423.1224 434.0232 463.5590 467.7145 473.3045 477.9944 483.9239 517.2636 545.1467 547.5413 586.9489 592.2673 617.0601 625.8979 635.2378 715.8362 715.9660 728.9794 742.4349 796.1876 797.5485 825.2192 937.4343 938.0303 967.1760 969.6972 971.4230 974.1550 1001.2210 1038.4102 1038.8852 1051.9982 1054.8662 1116.2637 1138.1939 1142.9656 1142.9999 1146.5913 1190.2738 1190.9564 1223.9689 1224.2255 1264.4835 1278.1360 1279.1831 1312.6529 1312.7164 1343.9861 1367.2774 1367.4826 1446.3773 1446.9524 1464.8949 1465.1288 1481.2300 1497.7214 1498.6636 1552.8922 1600.7279 1600.9581 1649.9888 1650.3040 2974.9566 2974.9850 3027.8678 3028.1681 3048.2471 3048.2691 3114.9706 3115.0836 3149.2827 3170.5263 3541.7179 3541.7665 3549.7836 3549.8036 3703.7320 3703.7501
redmass: 5.7403 8.0183 7.8722 5.5296 5.3629 5.0263 6.6707 4.3625 5.6815 4.8643 7.2448 3.4478 3.6151 5.7480 5.2428 1.9500 1.2663 5.2086 2.9242 1.9668 2.0241 4.7510 4.9454 6.3437 3.2211 3.4356 1.6029 1.3824 3.5914 1.6657 1.8057 8.5152 1.2408 1.2437 4.9662 4.2612 5.7895 5.2068 6.7332 9.2355 9.2705 7.0418 8.6942 1.8147 1.8592 1.4593 2.3542 2.3670 2.9342 1.4278 1.8047 2.6690 5.5271 1.7779 1.8270 2.2104 2.2396 3.2683 2.9687 2.2304 2.2352 2.4572 1.3003 1.3069 1.3100 1.2974 3.4730 1.2429 1.2835 1.6509 1.6444 2.2932 1.4190 1.4144 1.0891 1.0890 1.1022 1.0986 4.4443 2.3601 2.3728 6.2589 1.3365 1.3326 3.5655 3.6145 1.0648 1.0648 1.0600 1.0600 1.0947 1.0947 1.1088 1.1087 1.0890 1.1000 1.0611 1.0610 1.0612 1.0613 1.1039 1.1039
irintensity: 0.1641 0.0290 0.0929 30.0241 1.7085 0.9848 26.0344 0.8897 0.3714 3.1330 16.6593 0.7398 17.8681 1.2082 12.6445 1.3077 3.9292 2.1938 12.6127 0.5671 13.4366 1.9851 9.3429 0.0180 19.1470 5.3248 501.4844 23.9814 48.4404 199.9122 1.0202 32.9185 268.4325 4.5517 38.0870 3.9004 5.1404 0.8948 11.2514 36.8381 1.8260 0.0245 7.1278 5.8549 21.5033 38.1882 8.6021 30.5366 8.9575 3.3004 10.3956 2.1552 0.3789 15.5584 2.4369 44.1498 8.0360 220.9407 0.0001 13.2955 14.1776 21.0357 0.0056 0.1808 15.3365 41.6309 4.9891 9.5800 14.2708 22.0028 287.1100 237.9642 18.7076 14.0067 3.2121 11.9112 59.5702 41.1138 9.1269 597.9981 193.0129 7.8330 106.7007 74.2367 214.7905 361.9903 92.7257 13.7044 45.2927 8.0080 11.5754 8.2438 20.1859 0.0569 1.6410 4.2672 53.0232 23.2586 18.2168 9.2238 23.5443 50.2378
temp: 298.150 k
press: 1.00000 atm
elementType: 16 16 8 8 7 7 7 7 7 7 6 6 6 6 6 6 6 6 6 6 1 1 1 1 1 1 1 1 1 1 1 1 1 1 1 1
symmnumber: 1
zpe: 716576.4 jmol-1
zpe.correction: 0.272930 hartree
zpe.thermalcorrener: 0.294738 hartree
zpe.thermalcorrenthalpy: 0.295683 hartree
zpe.thermalcorrgfe: 0.215796 hartree
zpe.sumelectzpe: -1664.227084 hartree
zpe.sumelectthermal: -1664.205275 hartree
zpe.sumelectthermalent: -1664.204331 hartree
zpe.sumelectthermalfe: -1664.284218 hartree
dipole: -0.0009 8.4280 -0.0089
dipole: 8.4280
quadrupole: -149.4080 -148.4238 -109.7515
quadrupole: -0.0167 -13.6161 0.0359
quadrupole: -13.5469 -12.5627 26.1096 -0.0167 -13.6161 0.0359
hfenergy: -1664.5000138 hartree
pointgroup: C01 [X(C10H16N6O2S2)]
dipole: -0.0008015 -3.3158372 0.0046872 debye
polarizability: 232.299988|-0.0945029|193.955211|-49.5602077|-0.0067781|182.6200372 unknown
InChI: InChI=1S/C10H16N6O2S2/c11-9(17)13-3-5-19-7-1-2-8(16-15-7)20-6-4-14-10(12)18/h1-2,13-14H,3-6,11-12H2
charge 0 multiplicity 1
36 atoms
S  2.609359 -1.695641 -1.830126
S  -2.607129 -1.689884 1.833105
O  5.209336 2.68355 -0.128181
O  -5.212117 2.683126 0.122339
N  4.652039 0.423512 -0.401203
N  -4.653605 0.424056 0.400832
N  0.565703 -0.517703 -0.39853
N  -0.564095 -0.516448 0.396952
N  5.287854 1.250601 1.710258
N  -5.293677 1.244863 -1.711806
C  4.327364 0.569747 -1.819153
C  -4.32621 0.57459 1.817717
C  2.87916 0.171975 -2.146608
C  -2.877121 0.178715 2.1435
C  1.114758 -1.702519 -0.779457
C  -1.112584 -1.700073 0.782407
C  0.572226 -2.967448 -0.39697
C  -0.569461 -2.966191 0.404725
C  5.055272 1.521851 0.361438
C  -5.058686 1.520051 -0.364208
H  5.037285 -0.006076 -2.446718
H  4.467055 1.640631 -2.058831
H  -5.034541 0.000161 2.448346
H  -4.46611 1.646077 2.054557
H  2.143992 0.688305 -1.50771
H  2.649017 0.337959 -3.211416
H  -2.644805 0.348619 3.207219
H  -2.14358 0.693153 1.501222
H  4.518887 -0.496628 0.021305
H  -4.520903 -0.497242 -0.019286
H  1.037846 -3.901614 -0.724268
H  -1.034615 -3.899326 0.735609
H  5.577312 2.033578 2.289787
H  5.139391 0.340707 2.140415
H  -5.584461 2.026085 -2.293037
H  -5.145753 0.333779 -2.139623
