program: Gaussian 09
title: 000252289
version: EM64L-G09RevD.01
frameworkgroup: C1[X(C18H28O3)]
method: RPBEPBE
basis: SDD
operation: Freq
keyword: #pfreq=noraman
keyword: PBEPBE/SDD
title: #p freq=noraman PBEPBE/SDD
converged: YES YES NO NO
title: Mulliken charges:
elementType: O O O C C C C C C C C C C C C C C C C C C H H H H H H H H H H H H H H H H H H H H H H H H H H H H
charge: -0.441368 -0.212716 -0.221043 -0.117997 -0.159726 -0.101922 0.383948 0.311778 -0.537419 -0.518938 -0.054148 -0.495327 -0.539217 -0.193771 -0.475860 -0.460387 -0.797892 -0.410398 -0.817070 -0.610878 0.185626 0.247533 0.208150 0.185819 0.219592 0.213219 0.199786 0.199664 0.219572 0.223144 0.201311 0.215150 0.226360 0.201990 0.203804 0.202929 0.239940 0.217029 0.227972 0.215808 0.233351 0.236005 0.218304 0.223822 0.238998 0.225343 0.253853 0.254294 0.331984
chargesum: 0.00000
title: Mulliken charges with hydrogens summed into heavy atoms:
elementType: O O O C C C C C C C C C C C C C C C C C C
charge: -0.109383 -0.212716 -0.221043 0.129536 0.048424 0.083897 0.383948 0.311778 -0.104608 -0.119489 0.165424 -0.070872 -0.097707 0.008219 -0.069127 -0.003418 -0.120761 0.043910 -0.128907 -0.102731 0.185626
polarizability: 2.40712190e+02 5.01790044e+00 1.82151411e+02 1.01939173e+00 9.46321492e-01 1.49545576e+02
1716.lowfreq: -6.5005 -0.0007 -0.0003 -0.0001 9.1005 14.3167 39.3848 64.4731 77.0137
frequency: 39.2267 64.4444 76.9584 91.6720 115.3370 119.1769 145.0780 169.1108 186.7552 208.0810 211.4812 217.5262 245.6456 256.2173 277.5528 286.3474 297.7399 304.6128 315.7787 355.9292 365.8937 376.8412 391.3868 420.8661 429.6208 445.8773 478.4652 503.0336 512.1015 534.7128 539.8902 556.3124 581.3117 600.6097 638.0010 691.8724 713.1566 728.3776 754.6995 804.4963 826.7080 834.9739 844.3000 867.2922 890.7481 907.5185 919.9264 935.7427 950.3945 955.2475 964.4916 973.3382 985.2672 1002.6720 1007.7516 1014.9471 1022.1549 1035.1534 1040.1015 1059.9190 1073.5188 1087.2225 1096.2444 1117.0908 1123.3336 1128.6720 1140.5122 1145.8110 1152.5694 1162.0037 1174.3348 1189.9121 1200.2064 1209.5566 1215.1184 1221.9306 1231.0440 1239.3838 1246.5713 1248.9844 1264.3211 1276.9175 1285.7457 1288.3625 1292.2766 1304.9326 1310.8537 1324.0089 1331.6116 1331.8197 1335.9057 1342.5677 1345.6213 1352.7853 1361.1850 1365.4214 1367.9195 1380.4106 1394.4457 1402.2515 1438.2365 1457.1224 1465.4239 1465.9412 1468.0717 1469.6411 1472.3647 1475.6982 1485.0708 1489.8581 1492.7254 1496.8769 1655.8455 2894.6230 2901.6674 2921.8779 2934.1671 2945.6566 2950.2744 2969.8115 2971.2677 2982.7768 2984.4159 2987.6274 2993.9520 2995.8343 2996.9841 3005.2200 3021.3171 3021.8550 3032.4360 3038.4453 3052.0085 3054.3611 3079.8503 3081.6651 3084.6069 3084.7625 3091.4702 3092.8478 3555.7732
redmass: 5.1516 3.7986 3.2259 1.7443 3.6601 3.2718 1.8532 2.2471 1.3020 3.0187 3.0608 3.3892 2.1240 2.5848 1.2824 2.2559 2.6313 2.5127 2.4603 2.3124 2.8791 3.6798 3.8385 3.2629 3.3095 3.7539 2.3116 2.9325 3.3141 2.8778 2.4957 3.9180 3.7857 2.7189 3.5076 3.7897 2.3222 3.3763 3.6541 2.1964 1.9452 1.6005 1.9994 2.0811 1.8502 1.6571 2.0256 2.1238 1.8088 2.5347 2.1611 3.1346 2.4337 1.9497 2.3207 2.4726 2.1763 1.8802 2.1207 2.0900 2.6700 2.4225 1.4974 2.3621 2.3724 2.1061 1.6937 2.4951 1.7646 2.3122 1.6041 1.5867 1.7311 1.5794 1.6190 1.6629 1.2076 1.4565 1.3411 1.4144 1.4228 1.5085 1.5168 1.4617 1.3505 1.3576 1.4376 1.3867 1.3993 1.4432 1.3603 1.4695 1.4196 1.5571 1.4283 1.4475 1.4266 1.3501 1.2249 1.2140 1.0757 1.0782 1.0848 1.0779 1.0804 1.0797 1.0760 1.0813 1.0599 1.0633 1.0815 1.0558 12.1329 1.0811 1.0799 1.0843 1.0821 1.0599 1.0666 1.0621 1.0799 1.0627 1.0649 1.0635 1.0518 1.0465 1.0390 1.0951 1.0698 1.0896 1.0998 1.1012 1.1016 1.0956 1.0978 1.1007 1.1006 1.0993 1.0986 1.0983 1.0661
irintensity: 4.1368 0.6512 2.1884 1.6937 4.1232 1.7358 2.1399 0.9142 0.9535 4.5663 0.0692 0.6967 0.2756 8.7144 97.9951 44.5617 10.0005 1.2365 7.6796 0.6930 2.5901 0.1590 4.3227 0.1112 1.2250 8.3785 0.1711 5.1328 5.3914 1.3365 0.6654 3.1007 6.3980 2.7314 0.5311 0.4652 0.8818 8.8227 16.0589 0.6166 6.8863 2.3446 3.2699 1.2057 2.6471 6.5381 8.2358 7.6132 6.2413 16.9106 10.9961 93.7570 22.1860 25.4244 63.9216 4.7149 1.7930 14.1755 19.1706 7.3050 1.4398 20.8550 4.7304 9.5505 17.9388 32.6162 9.8114 84.8468 1.4241 87.1382 5.1135 2.1775 6.0791 8.1347 6.1747 1.4800 16.4424 7.4115 0.1176 3.6271 1.5143 0.4328 2.3197 5.1588 6.2105 9.1688 0.3079 2.1444 2.4060 0.9055 4.1433 1.8274 0.7174 0.4173 1.1835 2.5694 4.5778 3.8814 16.5376 24.6171 12.2552 4.0111 10.4108 14.0768 0.5303 14.3159 8.1596 1.2320 0.7306 8.9946 10.1276 13.3073 370.7211 0.5043 18.2849 53.8994 17.6243 57.6456 19.2010 35.7015 24.5921 25.0160 36.3631 24.2360 20.9351 22.1258 22.0574 58.6665 22.6627 51.6365 39.1808 75.1882 14.5734 21.5668 25.8053 43.1207 30.0006 27.4939 27.6316 30.0582 5.0396
temp: 298.150 k
press: 1.00000 atm
elementType: 8 8 8 6 6 6 6 6 6 6 6 6 6 6 6 6 6 6 6 6 6 1 1 1 1 1 1 1 1 1 1 1 1 1 1 1 1 1 1 1 1 1 1 1 1 1 1 1 1
symmnumber: 1
zpe: 1125773.7 jmol-1
zpe.correction: 0.428785 hartree
zpe.thermalcorrener: 0.448761 hartree
zpe.thermalcorrenthalpy: 0.449706 hartree
zpe.thermalcorrgfe: 0.382334 hartree
zpe.sumelectzpe: -926.740192 hartree
zpe.sumelectthermal: -926.720215 hartree
zpe.sumelectthermalent: -926.719271 hartree
zpe.sumelectthermalfe: -926.786642 hartree
dipole: -4.4146 1.1099 -0.6445
dipole: 4.5974
quadrupole: -187.7120 -122.2936 -124.1904
quadrupole: 12.4775 6.4570 0.9981
quadrupole: -42.9800 22.4384 20.5416 12.4775 6.4570 0.9981
hfenergy: -927.1689765 hartree
pointgroup: C01 [X(C18H28O3)]
dipole: 1.7386382 0.4272698 0.2572337 debye
polarizability: 240.639697|-5.3700286|182.2044246|1.3549663|-1.1476178|149.5650546 unknown
InChI: InChI=1S/C18H28O3/c1-17-8-7-14-12(13(17)5-6-15(17)19)4-3-11-9-16(20)21-10-18(11,14)2/h11-15,19H,3-10H2,1-2H3
charge 0 multiplicity 1
49 atoms
O  5.317069 -1.133614 0.149192
O  -3.954706 -1.409758 0.348971
O  -5.874312 -0.20034 0.179989
C  0.636337 0.811346 -0.219668
C  2.070528 0.71679 0.336717
C  -0.185546 -0.410536 0.314827
C  2.805383 -0.60175 -0.05515
C  -1.679022 -0.373306 -0.186292
C  0.529932 -1.769898 0.057927
C  2.008027 -1.787136 0.538248
C  -2.305878 0.986371 0.274692
C  -0.039467 2.1452 0.184191
C  3.096444 1.835373 0.004328
C  4.188186 -0.318229 0.616974
C  -1.520003 2.209016 -0.246554
C  4.486921 1.169829 0.284139
C  2.996067 -0.775062 -1.583069
C  -2.473633 -1.478633 0.54444
C  -1.799576 -0.583688 -1.719083
C  -3.800681 1.066923 -0.095703
C  -4.627197 -0.190424 0.17279
H  0.678724 0.766438 -1.328427
H  1.969975 0.695059 1.448536
H  -0.229519 -0.278059 1.423286
H  0.500893 -2.016059 -1.020336
H  -0.014812 -2.582999 0.575748
H  2.031427 -1.719817 1.647415
H  2.466237 -2.75907 0.261368
H  -2.229393 0.997446 1.385696
H  0.518666 2.994543 -0.253825
H  0.025118 2.257661 1.288113
H  2.936982 2.738196 0.619492
H  3.008349 2.14621 -1.053957
H  4.064767 -0.452515 1.716833
H  -1.988225 3.137943 0.135615
H  -1.59041 2.256332 -1.352239
H  5.144557 1.199585 -0.602555
H  5.031154 1.662078 1.108198
H  3.646499 -1.645275 -1.782325
H  2.037564 -0.935063 -2.105254
H  3.486564 0.101299 -2.040714
H  -2.223215 -2.487988 0.180164
H  -2.292078 -1.432542 1.636868
H  -1.299944 -1.518386 -2.02855
H  -2.855668 -0.669185 -2.030571
H  -1.34538 0.242985 -2.291156
H  -3.918796 1.289141 -1.175522
H  -4.298328 1.898608 0.435262
H  5.203917 -2.061641 0.47683
