program: Gaussian 09
title: 000252250
version: EM64L-G09RevD.01
frameworkgroup: C1[X(C10H12O3)]
method: RPBEPBE
basis: SDD
operation: Freq
keyword: #pfreq=noraman
keyword: PBEPBE/SDD
title: #p freq=noraman PBEPBE/SDD
converged: NO YES NO NO
title: Mulliken charges:
elementType: O O O C C C C C C C C C C H H H H H H H H H H H H
charge: -0.198215 -0.159269 -0.159271 -0.132346 -0.132345 -0.240490 -0.240489 -0.470201 -0.479572 -0.470196 -0.479593 0.137716 0.137717 0.249786 0.249786 0.281438 0.281439 0.222861 0.223688 0.216287 0.249213 0.223688 0.222862 0.249217 0.216290
chargesum: 0.00000
title: Mulliken charges with hydrogens summed into heavy atoms:
elementType: O O O C C C C C C C C C C
charge: -0.198215 -0.159269 -0.159271 0.117439 0.117442 0.040948 0.040950 -0.023652 -0.014073 -0.023647 -0.014085 0.137716 0.137717
polarizability: 1.07524923e+02 5.89495403e-05 1.15229009e+02 -3.39241471e+00 -7.45402659e-05 8.55463821e+01
1716.lowfreq: -10.9897 -0.0003 -0.0003 0.0005 9.0384 13.3749 32.5672 128.8925 146.8097
frequency: 28.5232 128.8925 146.6992 150.0421 212.0223 258.4618 302.5577 371.5207 408.5790 424.1253 507.5957 546.7651 565.5016 582.1138 617.8230 672.6162 725.7708 765.8518 796.3983 807.5105 816.4489 829.3616 836.8569 870.5703 911.0168 919.7028 954.0576 972.6614 1049.6579 1056.7697 1064.4735 1067.8579 1090.9570 1108.3582 1114.4718 1130.7457 1157.2381 1202.5831 1212.1928 1227.6166 1231.3274 1257.1310 1264.5118 1279.8232 1300.2951 1314.3475 1314.9777 1324.5122 1333.5673 1342.1135 1361.6049 1464.0651 1477.5611 1478.7632 1498.6424 1697.2700 1766.2956 2982.6881 2989.5188 2998.5135 3002.9394 3009.0845 3024.2099 3033.6994 3035.1217 3037.9610 3043.0180 3058.2954 3064.6750
redmass: 3.6512 15.9246 2.8668 5.1499 2.8076 1.9441 4.5165 2.8834 5.2195 3.9586 4.8431 4.5939 7.9846 10.1299 6.2918 6.1891 6.4954 2.3991 2.4586 1.8048 10.3319 2.6544 1.8201 2.5201 2.7394 2.2173 2.1994 3.7733 2.0537 2.3367 2.0362 2.2357 1.8963 1.6838 2.5159 1.5876 1.0364 1.4007 1.4761 1.1771 1.1749 1.6697 1.5780 1.3712 1.8561 1.6669 1.3623 1.3811 1.5378 1.4198 1.4175 1.0759 1.0867 1.0754 1.0872 12.9734 12.8436 1.0601 1.0599 1.0629 1.0632 1.0837 1.0845 1.1027 1.0883 1.1010 1.0878 1.1037 1.1028
irintensity: 0.2713 2.0830 0.3557 5.4225 2.2518 0.0365 3.7709 3.5703 4.5114 0.4432 9.4101 15.6203 3.0613 1.6631 0.9656 3.0961 23.1869 1.0186 2.1710 0.9740 293.9939 0.0095 15.6414 5.3349 4.1734 32.4671 3.2162 4.8743 4.9295 68.4774 16.6407 1.3399 0.1829 0.0143 87.8411 80.4931 1.5107 5.2414 0.2687 0.2528 0.7043 0.8163 26.4708 0.3277 0.0065 3.3029 0.0017 0.0070 0.6881 0.6523 3.3747 1.3814 16.7592 8.9659 11.6446 450.3681 107.5969 26.7788 14.7718 54.6211 44.5501 1.1861 13.5264 1.6488 54.2442 12.5162 2.4956 21.7924 87.9244
temp: 298.150 k
press: 1.00000 atm
elementType: 8 8 8 6 6 6 6 6 6 6 6 6 6 1 1 1 1 1 1 1 1 1 1 1 1
symmnumber: 1
zpe: 535924.0 jmol-1
zpe.correction: 0.204123 hartree
zpe.thermalcorrener: 0.214439 hartree
zpe.thermalcorrenthalpy: 0.215383 hartree
zpe.thermalcorrgfe: 0.167657 hartree
zpe.sumelectzpe: -612.976441 hartree
zpe.sumelectthermal: -612.966124 hartree
zpe.sumelectthermalent: -612.965180 hartree
zpe.sumelectthermalfe: -613.012906 hartree
dipole: 5.8623 -0.0001 -1.6355
dipole: 6.0861
quadrupole: -86.4074 -87.2670 -70.9703
quadrupole: 0.0001 3.0237 0.0001
quadrupole: -4.8591 -5.7188 10.5779 0.0001 3.0237 0.0001
hfenergy: -613.1805634 hartree
pointgroup: C01 [X(C10H12O3)]
dipole: -2.2911516 0.0004802 0.6957924 debye
dipolederiv: -0.5676398 -0.0001339 0.0952932 -0.0001091 -1.7893872 0.0004001 0.212776 0.0003873 -0.2237727 -0.5749588 0.2510509 0.046479 0.2369066 -1.0646063 -0.0189454 0.1209851 -0.108383 -0.3283534 -0.5750916 -0.2511571 0.0466161 -0.2369705 -1.0644049 0.0193224 0.1211319 0.1087283 -0.3284238 0.2396488 0.0183718 0.0282798 0.1036408 0.0925777 -0.0185241 0.1125931 0.0109555 0.0947169 0.2396127 -0.018394 0.0282975 -0.1036202 0.0926152 0.0185238 0.1126358 -0.0109883 0.0947105 -0.3905655 0.0000264 0.0890373 -0.0051947 -0.0150083 -0.0419634 0.1242468 -0.0551425 0.0386979 -0.390565 0.0001197 0.0890494 0.0053599 -0.0149541 0.0419671 0.1242702 0.0551375 0.038643 0.0237372 0.0500525 0.0364943 0.0051674 0.0602034 -0.02086 -0.0083654 -0.0437689 0.0978158 0.0718762 0.0003387 0.0089993 -0.0083643 0.0496021 0.0359066 0.0051117 0.0448687 -0.0060716 0.0237201 -0.0500219 0.0365212 -0.0051638 0.0602564 0.0208751 -0.0083556 0.043796 0.0977815 0.0718819 -0.0003426 0.0089882 0.0083611 0.049559 -0.0359412 0.005095 -0.044901 -0.0060367 0.971171 0.2055487 -0.1845273 -0.1883335 1.8700724 -0.0152398 -0.3798501 -0.1183028 0.3239361 0.9711674 -0.2054114 -0.1844135 0.1883709 1.8701349 0.0144728 -0.3799074 0.1175968 0.3238696 0.038137 0.0255667 -0.0008995 -0.0096004 -0.1482464 0.0110777 -0.0107267 0.0068379 0.0467766 0.0381335 -0.0256172 -0.0008888 0.0095443 -0.1482539 -0.0109765 -0.0107344 -0.0067333 0.0467852 0.0818868 -0.0050239 0.0036038 0.0301883 0.0257809 0.0447993 -0.0125848 0.0635889 -0.0659988 0.0818816 0.0050106 0.0035866 -0.0302086 0.0257288 -0.0448489 -0.0125858 -0.063631 -0.0659397 0.0782865 0.0166453 -0.0019684 -0.0124265 0.0005529 0.065963 0.052894 0.0983768 -0.1579451 -0.1200667 -0.0773127 -0.0614056 -0.0536233 0.0078357 -0.0227638 -0.1022015 -0.0628141 0.0350392 -0.0774419 -0.0957897 -0.1290661 -0.0492436 0.0090094 -0.0400512 -0.0937863 -0.0333929 0.0145677 -0.0578171 0.0795965 0.1171975 0.0439581 0.0067785 -0.0288374 0.0852406 -0.0177818 0.0187813 -0.1200196 0.0773025 -0.061456 0.053587 0.0078538 0.0228006 -0.1022301 0.0628609 0.0349742 0.0782816 -0.016657 -0.0019516 0.0124473 0.000456 -0.0660612 0.0528853 -0.0984826 -0.1578428 -0.0578705 -0.079514 0.1172422 -0.0438937 0.0068414 0.0288031 0.0852677 0.0177577 0.0187701 -0.0773859 0.0957452 -0.1291087 0.0492202 0.0090029 0.0401013 -0.0938052 0.0334299 0.0145192 unknown
polarizability: 107.359059|-0.0000278|115.2290073|-3.8892691|-0.0073466|85.7122478 unknown
InChI: InChI=1S/C10H12O3/c11-9-7-5-1-2-6(4-3-5)8(7)10(12)13-9/h5-8H,1-4H2
charge 0 multiplicity 1
25 atoms
O  2.204225 -0.000388 -0.222451
O  1.909789 -2.311213 -0.080047
O  1.910407 2.310587 -0.081257
C  -1.103989 -1.313205 -0.008931
C  -1.103633 1.313428 -0.009629
C  0.131396 -0.777115 0.779184
C  0.131601 0.777418 0.778776
C  -2.37551 -0.78408 0.707761
C  -1.077658 -0.783513 -1.466792
C  -2.375324 0.785025 0.707294
C  -1.077409 0.78298 -1.467209
C  1.458798 -1.186105 0.143671
C  1.459112 1.185715 0.143041
H  -1.083923 -2.418152 -0.003258
H  -1.083269 2.418373 -0.004529
H  0.106933 -1.195432 1.802572
H  0.107248 1.196286 1.801941
H  -2.41659 -1.176681 1.741562
H  -3.267738 -1.17463 0.184685
H  -1.962869 -1.175219 -2.000422
H  -0.193912 -1.180659 -2.000331
H  -3.267421 1.175474 0.183919
H  -2.416392 1.17826 1.740855
H  -0.193509 1.179563 -2.000912
H  -1.962466 1.174687 -2.001092
