program: Gaussian 09
title: 000252210
version: EM64L-G09RevD.01
frameworkgroup: C1[X(C5H7N5O2)]
method: RPBEPBE
basis: SDD
operation: Freq
keyword: #pfreq=noraman
keyword: PBEPBE/SDD
title: #p freq=noraman PBEPBE/SDD
converged: YES YES NO NO
title: Mulliken charges:
elementType: O O N N N N N C C C C C H H H H H H H
charge: -0.214816 -0.285175 -0.101784 -0.097126 0.042533 -0.613063 -0.574186 0.070826 0.213759 0.188565 -0.737518 -0.023554 0.251045 0.241476 0.251578 0.377131 0.330687 0.337587 0.342036
chargesum: 0.00000
title: Mulliken charges with hydrogens summed into heavy atoms:
elementType: O O N N N N N C C C C C
charge: -0.214816 -0.285175 -0.101784 -0.097126 0.042533 0.094755 0.105437 0.070826 0.213759 0.188565 0.006581 -0.023554
polarizability: 1.60660008e+02 1.42096987e+00 1.21643631e+02 -2.36948303e-02 -4.76662740e-02 4.41236687e+01
1716.lowfreq: -7.3295 -2.9031 -0.0005 -0.0004 -0.0004 11.3553 32.5960 79.9419 190.0652
frequency: 32.5494 79.9376 190.0647 201.1494 249.2487 267.4562 275.5405 327.6922 363.7497 367.9670 404.9902 523.3759 532.3696 557.7440 568.0508 573.5471 579.5024 606.3959 652.1138 669.8998 723.6543 757.1296 768.0539 794.3154 914.3283 943.5889 1039.9748 1052.9433 1071.5578 1111.5676 1140.3873 1213.4299 1304.1864 1331.2774 1387.7391 1398.2833 1408.3053 1444.9451 1451.8224 1496.2267 1502.6897 1545.6866 1581.7529 1617.9853 3005.4576 3087.0249 3129.4863 3391.1508 3551.2594 3631.3396 3710.0756
redmass: 5.9484 7.4773 3.4875 6.8428 1.0936 5.5313 7.3349 3.1206 3.0497 7.6055 6.1388 1.2276 7.3654 1.2496 3.4644 1.5325 5.3010 1.8264 6.7607 6.1728 9.7781 1.3054 10.6006 3.6819 3.4210 2.1552 1.6068 2.1065 3.9457 3.4014 2.7993 6.5616 7.8001 5.5264 3.7856 1.2549 3.6705 1.2991 1.0470 1.9990 2.7214 3.0046 3.1770 1.8786 1.0366 1.0952 1.1021 1.0538 1.0444 1.0967 1.1059
irintensity: 0.1682 0.0708 11.5372 3.2974 0.3894 0.2278 2.7975 12.1814 7.0026 6.5270 0.1927 255.6489 2.0034 9.4958 0.5757 19.9281 1.3361 182.1022 3.7637 20.3586 0.7773 44.3211 5.6013 98.6954 8.7311 5.5236 6.9603 9.4247 26.2196 24.2851 128.4963 242.1449 196.7214 38.2675 19.3765 42.8181 8.0835 85.5668 15.4496 44.2053 129.8256 329.3990 752.5099 389.9697 1.9691 5.5130 15.6626 87.3267 171.0271 88.9797 55.4573
temp: 298.150 k
press: 1.00000 atm
elementType: 8 8 7 7 7 7 7 6 6 6 6 6 1 1 1 1 1 1 1
symmnumber: 1
zpe: 362055.6 jmol-1
zpe.correction: 0.137900 hartree
zpe.thermalcorrener: 0.148515 hartree
zpe.thermalcorrenthalpy: 0.149459 hartree
zpe.thermalcorrgfe: 0.101351 hartree
zpe.sumelectzpe: -618.005687 hartree
zpe.sumelectthermal: -617.995072 hartree
zpe.sumelectthermalent: -617.994128 hartree
zpe.sumelectthermalfe: -618.042235 hartree
dipole: 5.2785 -1.3600 0.0035
dipole: 5.4508
quadrupole: -68.9777 -61.6050 -70.3732
quadrupole: 0.0276 -0.0573 0.0149
quadrupole: -1.9924 5.3803 -3.3879 0.0276 -0.0573 0.0149
hfenergy: -618.1435866 hartree
pointgroup: C01 [X(C5H7N5O2)]
dipole: 2.0627578 -0.5825883 -0.0680188 debye
dipolederiv: -0.7822378 0.2463407 0.0189056 0.4397373 -0.7645761 -0.0200415 0.0213651 -0.0139205 -0.2232721 -0.7771125 -0.220885 0.0100361 -0.4389096 -0.7806701 0.0054899 0.0059496 -0.0004395 -0.2989015 -1.3434269 0.2205184 0.0358487 0.5970898 -0.6909138 -0.0256703 0.0439996 -0.0155801 -0.2611701 -1.1730624 -0.4487967 0.0174659 -0.423451 -0.76806 0.0033176 0.018219 0.0047931 -0.2969504 2.0105047 -0.0698844 -0.0506584 -0.0249293 1.135339 0.0122553 -0.0489471 0.013492 0.2143459 -0.4485605 -0.3517694 -0.0125495 -0.3259321 -1.1645917 0.0001091 -0.011759 0.0002559 -0.6333038 -1.7454243 -0.0664561 0.0296147 0.0610809 -0.2088707 0.0078815 0.032715 0.011458 -0.6893582 -1.3044151 0.1763801 0.0393712 -0.2304517 -0.6815784 -0.0057057 0.0310052 -0.0173709 -0.0219949 1.1504876 -0.0763202 -0.0313734 0.3369683 0.7479127 0.0041185 -0.0246748 0.0154549 0.1126539 1.0987883 0.4046387 -0.0178988 0.0647752 1.2937904 0.0169601 -0.0223311 0.0066682 0.2407517 -0.0261847 0.2817458 0.006237 0.1515979 -0.245634 -0.0086937 0.0034822 -0.0119981 -0.0151745 2.1743668 0.0986742 -0.0556298 -0.2071202 0.9513217 0.0192074 -0.0633234 0.0110071 0.247517 0.067978 0.002399 0.0858482 -0.0133462 0.0835521 0.0099665 0.0627942 -0.0084476 -0.0078758 -0.0025373 -0.1688416 -0.0005451 -0.0545186 0.0055093 -0.0009931 0.0020368 0.0018356 0.1134615 0.0603149 0.0072124 -0.0889591 -0.0110267 0.0839932 -0.0055193 -0.0663128 0.0118258 0.0010775 0.2887833 -0.0718619 0.0015561 0.0459096 0.3546526 -0.0019608 0.0033466 0.0017389 0.3744014 0.1633221 0.0284604 0.0067203 0.0327302 0.2907827 -0.0024113 0.0066542 -0.0022094 0.3685804 0.2831991 -0.018237 0.0029431 -0.1082234 0.1687352 -0.0012486 0.0009581 -0.0038405 0.3897345 0.3052168 0.0266825 0.0030671 0.1080195 0.1893059 -0.0070614 0.0048227 -0.0047227 0.3854776 unknown
polarizability: 160.6103646|0.5625788|121.5732699|-3.3148138|1.3950767|44.2436732 unknown
InChI: InChI=1S/C5H7N5O2/c1-2-3(10(11)12)4(6)9-5(7)8-2/h6-7H2,1H3
charge 0 multiplicity 1
19 atoms
O  -2.747206 1.170046 0.093264
O  -2.757715 -1.099275 0.062106
N  1.469294 1.207207 -0.015518
N  1.43947 -1.245896 -0.063162
N  -2.105328 0.046849 0.06057
N  -0.538043 -2.44731 -0.027163
N  3.436054 -0.038438 -0.099551
C  -0.661128 0.031397 0.021098
C  0.11279 1.250258 0.02372
C  0.070377 -1.230659 -0.023034
C  -0.468075 2.643425 0.069356
C  2.068618 -0.040528 -0.058345
H  -1.090875 2.794102 0.967773
H  0.369026 3.357491 0.063094
H  -1.137192 2.832093 -0.787407
H  -1.565255 -2.469048 0.003856
H  0.058076 -3.273259 -0.060346
H  3.939102 -0.921682 -0.132539
H  3.923912 0.854126 -0.096573
