program: Gaussian 09
title: 000252202
version: EM64L-G09RevD.01
frameworkgroup: C1[X(C14H15N9)]
method: RPBEPBE
basis: SDD
operation: Freq
keyword: #pfreq=noraman
keyword: PBEPBE/SDD
title: #p freq=noraman PBEPBE/SDD
converged: YES YES NO NO
title: Mulliken charges:
elementType: N N N N N N N N N C C C C C C C C C C C C C C H H H H H H H H H H H H H H H
charge: -0.054403 -0.008820 0.003573 -0.067669 -0.140471 -0.620329 -0.617663 -0.572083 -0.516514 -0.139324 -0.040700 -0.017279 -0.124913 0.111077 0.073946 0.305717 0.217954 -0.355676 -0.354741 -0.231637 -0.232145 -0.639354 -0.233346 0.287731 0.271374 0.225609 0.222856 0.328033 0.342303 0.313600 0.419910 0.209950 0.221419 0.285860 0.225627 0.293896 0.312927 0.293703
chargesum: 0.00000
title: Mulliken charges with hydrogens summed into heavy atoms:
elementType: N N N N N N N N N C C C C C C C C C C C C C C
charge: -0.054403 -0.008820 0.003573 -0.067669 -0.140471 0.050007 0.115846 0.034741 -0.222811 -0.139324 -0.040700 -0.017279 -0.124913 0.111077 0.073946 0.305717 0.217954 -0.067944 -0.083367 -0.006028 -0.009290 0.077876 -0.007719
polarizability: 4.58537801e+02 2.08645883e+01 2.44798274e+02 -5.34753148e+00 4.75748055e+00 9.63538952e+01
1716.lowfreq: -0.0007 -0.0005 0.0005 1.7375 6.3109 6.7648 26.2491 40.2369 54.0492
frequency: 26.1851 40.1979 54.0434 71.9809 84.0343 105.0230 116.4297 132.4146 160.8371 178.9176 221.4579 226.0547 246.9884 262.6320 282.1028 314.7776 323.2149 340.8128 351.0783 364.8378 406.9377 425.2636 450.8349 454.7945 461.1408 482.4477 497.9146 529.7011 541.0658 580.8745 597.2087 601.9961 616.6681 618.4125 642.5836 658.5380 667.8236 673.1501 677.7763 694.2771 710.6793 755.0393 772.8587 790.8372 798.6398 824.4980 867.4404 875.9238 896.0314 901.9063 957.9085 979.8454 989.0531 996.7184 1001.8087 1011.8581 1025.3462 1032.4511 1074.0986 1078.1027 1106.8023 1115.3308 1142.1704 1169.6947 1175.9635 1184.3228 1198.4337 1243.2684 1244.2428 1270.6579 1290.2429 1308.3588 1335.0521 1358.2252 1381.6112 1391.3340 1403.5762 1413.2551 1423.5300 1440.3991 1443.4035 1473.7134 1483.5498 1488.4830 1497.6409 1510.9339 1529.7356 1554.9404 1586.3863 1588.4064 1602.1314 1612.7631 1659.6677 2934.4466 2946.5497 3028.4822 3122.9042 3131.3848 3136.6697 3152.7690 3167.5997 3173.6688 3334.7023 3395.4581 3532.3207 3534.0452 3590.8987 3692.4910
redmass: 5.4633 3.8864 3.9920 4.6084 5.0046 5.2032 5.7386 2.3579 3.1802 3.1327 5.3841 4.4711 2.2799 4.8563 8.2961 3.9928 3.5061 1.4626 2.7049 3.8294 2.8813 5.3065 3.2106 3.2150 5.5609 3.3076 5.2572 1.4707 6.4980 1.0749 3.0203 2.2114 6.2147 3.9759 2.9234 3.6393 6.9330 9.2331 2.2201 3.9007 1.7707 8.6091 6.6229 7.2020 3.0860 6.5672 1.2450 6.6810 3.0552 1.2575 1.4357 1.0951 5.5627 3.0826 1.3617 1.3341 1.9803 1.7912 1.6052 3.3375 2.4287 1.4340 2.4305 1.0580 1.1618 5.1388 2.6786 1.3907 2.1075 5.5030 3.6894 1.6917 4.4341 5.1581 3.0737 7.8478 6.3057 1.8192 1.5078 3.8253 2.5509 1.1698 2.5779 1.2294 2.9186 3.6019 4.0640 2.4275 5.8749 5.7265 1.9581 5.1885 1.1395 1.0466 1.0734 1.0924 1.0851 1.0952 1.0897 1.0950 1.0946 1.0980 1.0715 1.0436 1.0995 1.0436 1.0834 1.1055
irintensity: 1.2573 0.2353 0.3635 0.8231 2.2183 5.1784 3.1145 1.0162 2.7272 1.2841 0.6157 6.7550 6.3480 18.7568 0.2068 1.4494 25.4649 12.7525 7.3400 4.3988 0.0603 2.3697 8.7769 6.3031 15.3658 41.8189 7.1062 190.9117 14.0844 15.0386 44.4800 54.0889 1.6183 17.1821 52.1463 57.9830 21.8987 19.4343 110.1726 6.2317 85.9011 1.1343 11.6584 18.0421 23.8029 0.1076 0.0087 7.4450 67.2719 78.5351 5.0713 166.9197 0.9570 8.3361 0.1162 1.4790 30.2619 98.8626 8.3720 16.1521 22.0998 14.9181 9.5004 0.1706 38.9156 25.4293 15.2837 2.2669 30.7756 26.7595 29.3297 18.7599 40.9259 247.6508 68.9818 126.0149 257.4626 9.8294 37.3736 77.9656 15.4559 16.9834 90.2696 30.7234 24.5594 469.1425 759.2723 89.3807 170.1069 261.4824 361.5841 31.8533 33.6725 186.1597 476.7193 36.4950 0.1911 4.2428 20.5242 38.2909 10.7196 28.4006 57.6232 2.4251 4.3777 83.7616 69.4537 50.1910
temp: 298.150 k
press: 1.00000 atm
elementType: 7 7 7 7 7 7 7 7 7 6 6 6 6 6 6 6 6 6 6 6 6 6 6 1 1 1 1 1 1 1 1 1 1 1 1 1 1 1
symmnumber: 1
zpe: 765772.1 jmol-1
zpe.correction: 0.291667 hartree
zpe.thermalcorrener: 0.311463 hartree
zpe.thermalcorrenthalpy: 0.312407 hartree
zpe.thermalcorrgfe: 0.243176 hartree
zpe.sumelectzpe: -1033.623709 hartree
zpe.sumelectthermal: -1033.603914 hartree
zpe.sumelectthermalent: -1033.602970 hartree
zpe.sumelectthermalfe: -1033.672201 hartree
dipole: 6.3325 -5.2649 0.8367
dipole: 8.2777
quadrupole: -95.8957 -117.0913 -137.2874
quadrupole: -12.9374 5.3463 1.3945
quadrupole: 20.8625 -0.3332 -20.5293 -12.9374 5.3463 1.3945
hfenergy: -1033.9153767 hartree
pointgroup: C01 [X(C14H15N9)]
dipole: -2.4630152 -1.8443222 -1.0667654 debye
polarizability: 459.0679989|-16.8803378|229.7469529|-7.172743|44.4249751|110.8750187 unknown
InChI: InChI=1S/C14H15N9/c1-23(18)12(17)8-10(15)21-14-9(19-8)11(16)20-13(22-14)7-5-3-2-4-6-7/h2-6,17H,15-16,18H2,1H3
charge 0 multiplicity 1
38 atoms
N  -1.948464 -0.487676 -0.175501
N  1.395435 1.082122 0.228715
N  -0.760829 2.006426 0.562733
N  1.641564 -1.292694 -0.351392
N  -4.816745 -0.689373 -0.622722
N  -0.232797 -2.684299 -0.621752
N  -2.895119 2.866889 0.975377
N  -6.239227 -0.726905 -0.522954
N  -4.96569 1.363352 0.613187
C  -0.590026 -0.334272 -0.09358
C  0.023243 0.933315 0.23219
C  -2.741717 0.567453 0.104732
C  2.131328 -0.023041 -0.068579
C  0.296064 -1.448698 -0.359704
C  -2.118499 1.836538 0.553782
C  3.610566 0.130041 -0.087109
C  -4.228592 0.43611 0.016125
C  4.197108 1.392346 0.201412
C  4.449531 -0.975515 -0.391526
C  5.598236 1.543462 0.184483
C  5.851151 -0.82007 -0.408146
C  -4.246643 -1.43849 -1.759674
C  6.430748 0.438904 -0.120258
H  3.529972 2.227811 0.433897
H  3.979605 -1.938876 -0.6089
H  6.044009 2.519179 0.408238
H  6.492755 -1.676703 -0.643978
H  0.395129 -3.464313 -0.801751
H  -1.243194 -2.805812 -0.588089
H  -2.42969 3.720737 1.283173
H  -3.927403 2.64464 1.020209
H  -4.660239 -1.066118 -2.722458
H  -4.498734 -2.511101 -1.662576
H  -3.154491 -1.333423 -1.762221
H  7.520348 0.558493 -0.132868
H  -6.712131 -0.536731 -1.417946
H  -6.570286 -1.582701 -0.063519
H  -5.977478 1.142192 0.518549
