program: Gaussian 09
title: 000252180
version: EM64L-G09RevD.01
frameworkgroup: C1[X(C14H13N7S)]
method: RPBEPBE
basis: SDD
operation: Freq
keyword: #p
keyword: freq=noraman
keyword: PBEPBE/SDD
title: #p freq=noraman PBEPBE/SDD
converged: YES YES NO NO
title: Mulliken charges:
elementType: S N N N N N N N C C C C C C C C C C C C C C H H H H H H H H H H H H H
charge: 0.191906 -0.008156 -0.020206 -0.061870 0.004256 -0.615093 -0.615808 -0.389520 -0.142302 -0.030017 -0.120985 0.110098 0.304620 0.163797 0.074129 -0.352799 -0.351148 -0.349788 -0.230612 -0.230995 -0.230689 -0.839632 0.287862 0.272583 0.227485 0.225148 0.331302 0.354168 0.227670 0.323307 0.403272 0.273264 0.256582 0.289920 0.268252
chargesum: 0.00000
title: Mulliken charges with hydrogens summed into heavy atoms:
elementType: S N N N N N N N C C C C C C C C C C C C C C
charge: 0.191906 -0.008156 -0.020206 -0.061870 0.004256 0.070377 0.110772 -0.116256 -0.142302 -0.030017 -0.120985 0.110098 0.304620 0.163797 0.074129 -0.064936 -0.078566 -0.349788 -0.003128 -0.005848 -0.003019 -0.024878
polarizability: 4.68086140e+02 2.28568540e+01 2.50872601e+02 -8.23916377e+00 4.37639087e+00 9.91891909e+01
1716.lowfreq: -0.0021 -0.0008 -0.0007 2.2244 4.8513 6.0847 26.1220 40.8384 60.1731
frequency: 26.1159 40.8118 60.1725 76.8411 82.7289 102.4333 109.2096 133.3723 137.8149 167.7401 202.6777 221.6770 232.4607 277.4414 282.1110 308.6504 315.9823 332.7405 406.5497 410.4080 426.4150 456.3282 473.5669 484.8656 490.3475 545.3297 551.8794 585.3973 604.8569 612.5978 615.6811 622.1924 638.4830 650.7714 665.2132 673.2526 693.0158 710.7610 747.0454 757.4195 762.5558 797.3579 822.9409 838.4238 839.8513 867.8111 883.3571 890.7720 959.7657 967.8027 988.9977 991.5285 997.9368 1002.9197 1012.7659 1025.6116 1069.9864 1075.4988 1109.4105 1139.1941 1170.5649 1176.3954 1189.8965 1249.1399 1283.2658 1286.7443 1308.0133 1332.4864 1351.5120 1360.0220 1391.5191 1395.2127 1423.2797 1435.0286 1442.4232 1444.5803 1470.7887 1484.0053 1503.3765 1509.7412 1535.3843 1568.5588 1585.8652 1588.6891 1604.8700 1613.5819 3018.6044 3124.8932 3137.7983 3138.6060 3154.2342 3156.8197 3168.7189 3174.8338 3182.2053 3387.3633 3521.7011 3603.7684 3681.6805
redmass: 6.3658 4.0590 5.0943 3.6867 6.6029 4.6235 5.7443 2.1062 1.7272 6.0909 4.0213 6.1801 5.0175 5.9154 7.8025 5.3066 4.3607 5.7266 2.8787 5.7910 5.9114 4.2506 5.3655 4.3951 5.5707 7.2529 1.3591 2.3824 3.8090 1.2871 5.1633 5.3436 2.3604 5.7597 7.6425 8.4735 3.7738 1.7890 6.3516 6.9784 4.1363 2.5844 3.2905 5.6078 1.7703 1.2444 5.3097 1.1182 1.4338 1.1769 5.2596 1.2969 3.0804 1.3651 1.3346 1.9725 2.9527 1.6019 2.9552 2.2404 1.0582 1.1628 2.5808 2.6715 5.1252 5.6437 1.5440 1.1659 8.1124 5.2062 8.3528 7.5170 3.5795 3.3970 1.1232 2.2244 1.0630 2.7419 4.3540 3.5073 3.5372 3.1696 5.6937 3.2356 2.2283 4.0630 1.0280 1.0852 1.1041 1.0897 1.0949 1.1055 1.0947 1.0981 1.0667 1.0765 1.0443 1.0876 1.1051
irintensity: 0.1301 0.1826 1.4821 3.0689 0.2396 2.3888 1.5910 0.7455 1.1320 0.3110 5.3824 0.7467 2.2202 3.9617 0.8232 14.7533 5.0399 4.2231 0.0376 8.8814 4.2514 2.0375 3.9309 15.7862 4.7115 6.9237 140.4067 87.0073 2.3731 32.0706 1.3012 6.0633 98.9738 8.1290 14.1446 36.0001 3.5914 95.2841 81.6227 66.6386 1.5709 32.2263 1.4866 59.4696 8.1049 0.0173 26.3242 179.3772 5.7760 14.7217 3.5063 13.6312 9.4845 0.0674 1.2454 19.9493 2.0577 16.2326 63.3728 30.3756 0.1969 58.1584 40.8496 116.5416 36.1954 3.4392 12.3758 5.6593 87.1749 202.7410 315.2195 215.1822 39.4199 47.8729 9.4292 9.6499 6.5725 92.0654 658.1441 28.0150 754.3609 13.7653 40.6099 428.7612 339.6431 85.9249 29.5988 0.1537 7.1348 19.0668 37.0653 4.5053 10.4647 33.7735 272.3514 38.3869 87.9062 84.0975 54.6481
temp: 298.150 k
press: 1.00000 atm
elementType: 16 7 7 7 7 7 7 7 6 6 6 6 6 6 6 6 6 6 6 6 6 6 1 1 1 1 1 1 1 1 1 1 1 1 1
symmnumber: 1
zpe: 682673.0 jmol-1
zpe.correction: 0.260016 hartree
zpe.thermalcorrener: 0.279148 hartree
zpe.thermalcorrenthalpy: 0.280092 hartree
zpe.thermalcorrgfe: 0.211748 hartree
zpe.sumelectzpe: -1321.100812 hartree
zpe.sumelectthermal: -1321.081680 hartree
zpe.sumelectthermalent: -1321.080736 hartree
zpe.sumelectthermalfe: -1321.149080 hartree
dipole: 2.8017 -2.5052 0.9303
dipole: 3.8718
quadrupole: -117.4368 -117.0923 -137.8717
quadrupole: 4.2604 4.8168 0.0709
quadrupole: 6.6968 7.0413 -13.7381 4.2604 4.8168 0.0709
hfenergy: -1321.3608279 hartree
pointgroup: C01 [X(C14H13N7S1)]
dipole: -1.0666483 -0.9786029 -0.474296 debye
polarizability: 469.4425248|-15.4230246|249.1597621|-5.7050132|9.8004225|99.545645 unknown
InChI: InChI=1S/C14H13N7S/c1-22-12(17)8-10(15)20-14-9(18-8)11(16)19-13(21-14)7-5-3-2-4-6-7/h2-6,17H,15-16H2,1H3
charge 0 multiplicity 1
35 atoms
S  -5.199592 -1.429075 -0.187896
N  1.087613 1.044985 -0.000057
N  -2.236654 -0.605186 0.079266
N  1.35273 -1.398912 0.090213
N  -1.07397 2.012821 0.075365
N  -0.519047 -2.817333 0.24185
N  -3.213132 2.938255 0.210419
N  -5.309117 1.312765 0.227004
C  -0.886406 -0.420092 0.09399
C  -0.280106 0.895282 0.054548
C  1.832299 -0.096659 0.007936
C  0.009651 -1.56168 0.139798
C  3.307761 0.056404 -0.06922
C  -3.037749 0.484567 0.072622
C  -2.427834 1.831511 0.119025
C  3.883335 1.353967 -0.153031
C  4.15526 -1.084571 -0.061899
C  -4.502387 0.291768 0.034503
C  5.282222 1.504514 -0.2293
C  5.554455 -0.929296 -0.138777
C  6.122917 0.364597 -0.222707
C  -4.36315 -2.024945 -1.775371
H  3.210102 2.216345 -0.155723
H  3.693984 -2.073885 0.004962
H  5.720037 2.506842 -0.293643
H  6.203049 -1.812487 -0.132753
H  0.10511 -3.620038 0.284487
H  -1.530517 -2.919381 0.32315
H  7.210929 0.483904 -0.281829
H  -2.755191 3.849014 0.235882
H  -4.238565 2.776787 0.283569
H  -6.316515 1.081358 0.155745
H  -4.766318 -3.033419 -1.958336
H  -3.276845 -2.060797 -1.621793
H  -4.624562 -1.360129 -2.611597
