program: Gaussian 09
title: 000252170
version: EM64L-G09RevD.01
frameworkgroup: C1[X(C10H11N5O3)]
method: RPBEPBE
basis: SDD
operation: Freq
keyword: #p
keyword: freq=noraman
keyword: PBEPBE/SDD
title: #p freq=noraman PBEPBE/SDD
converged: YES YES NO NO
title: Mulliken charges:
elementType: O O O N N N N N C C C C C C C C C C H H H H H H H H H H H
charge: -0.245239 -0.220806 -0.212992 -0.177198 0.079377 -0.090935 -0.044683 -0.571414 0.211201 0.037367 0.139333 -0.096265 -0.620289 -0.339452 0.179181 -0.013883 -0.255307 -0.655089 0.253214 0.252563 0.274441 0.272985 0.235406 0.223542 0.211682 0.238832 0.251420 0.338121 0.344887
chargesum: 0.00000
title: Mulliken charges with hydrogens summed into heavy atoms:
elementType: O O O N N N N N C C C C C C C C C C
charge: -0.245239 -0.220806 -0.212992 -0.177198 0.079377 -0.090935 -0.044683 0.111593 0.211201 0.037367 0.139333 -0.096265 0.159929 -0.066467 0.179181 -0.013883 0.203641 0.046844
polarizability: 2.81729219e+02 1.62605677e+01 1.48220176e+02 7.57952839e+00 -2.09582139e+00 8.49797864e+01
1716.lowfreq: -3.6974 -0.0005 0.0004 0.0005 2.3007 7.2186 19.5062 42.1088 45.9900
frequency: 18.8406 42.0609 45.9776 75.2544 89.5554 111.1049 114.8652 152.7664 166.1039 186.8989 224.2485 237.9976 274.7803 293.8022 302.9302 353.5735 394.8390 417.8680 435.4786 441.0892 480.2114 515.1258 522.3112 535.2629 538.9215 562.7734 591.6494 676.2033 703.0455 714.5773 733.8648 760.4485 791.5182 805.9116 821.2571 826.8606 847.5880 905.4513 944.2423 950.5165 1004.6872 1048.3387 1068.6812 1096.2264 1113.3391 1124.1314 1157.0971 1219.4415 1253.9627 1261.0457 1273.5298 1297.8953 1319.2675 1348.1900 1358.4951 1392.9948 1394.6565 1444.3342 1457.6629 1461.0955 1463.2478 1475.0614 1483.2137 1488.4910 1496.2565 1529.3404 1555.2060 1600.2368 1618.1577 1638.1498 2995.7925 3016.1795 3030.5702 3091.7123 3097.8258 3109.9847 3123.2013 3142.0433 3154.7562 3551.3949 3709.3895
redmass: 4.3531 4.1138 4.5235 3.5179 5.0746 1.0511 5.1066 4.8129 3.4578 1.5595 4.5103 4.0748 5.5745 5.1700 4.3991 3.5530 4.3326 4.1746 7.7949 4.3143 4.8256 5.8254 5.3888 1.4560 5.7713 1.0433 7.8280 8.0320 7.4594 5.1790 9.3116 6.6495 3.8379 3.1647 2.2301 6.2369 5.5611 4.6890 1.4726 2.6866 2.7543 2.3442 3.7635 2.1775 5.2316 1.3224 1.6921 3.7738 3.5560 5.5275 1.1232 1.9191 5.3614 1.7069 3.2062 1.2247 1.6980 2.1905 1.0560 1.1021 1.4384 1.0559 1.0570 2.4185 4.1257 6.0651 7.1873 4.1123 2.1626 10.3047 1.0365 1.0326 1.0599 1.0977 1.1028 1.1018 1.1056 1.1027 1.0937 1.0445 1.1059
irintensity: 1.1076 3.0252 2.7517 0.1294 1.0705 0.0137 0.6822 0.2607 1.5542 5.7534 2.3756 0.8086 1.0219 5.2851 11.1581 4.8878 24.4678 0.3937 9.5985 22.4323 14.8095 4.0989 6.5650 247.0975 33.8951 9.8264 27.7958 5.2644 3.9215 16.8240 2.6161 3.2871 1.1087 27.0927 5.1690 4.9403 1.1745 18.3876 10.0555 23.9521 48.2057 6.2808 213.6407 42.1155 200.8677 0.2087 36.4355 18.7041 24.1028 81.7589 5.2554 52.7774 13.6759 1.1956 3.7378 28.5310 16.8100 43.3901 17.8121 5.9452 54.7858 19.7450 16.7542 20.8900 232.0439 89.0512 924.9865 203.7652 421.2764 141.3313 19.6454 16.1917 34.6655 35.4123 3.4293 12.5531 29.3374 1.0923 3.7457 222.5848 55.9879
temp: 298.150 k
press: 1.00000 atm
elementType: 8 8 8 7 7 7 7 7 6 6 6 6 6 6 6 6 6 6 1 1 1 1 1 1 1 1 1 1 1
symmnumber: 1
zpe: 562681.9 jmol-1
zpe.correction: 0.214314 hartree
zpe.thermalcorrener: 0.231176 hartree
zpe.thermalcorrenthalpy: 0.232120 hartree
zpe.thermalcorrgfe: 0.168135 hartree
zpe.sumelectzpe: -885.807586 hartree
zpe.sumelectthermal: -885.790725 hartree
zpe.sumelectthermalent: -885.789780 hartree
zpe.sumelectthermalfe: -885.853766 hartree
dipole: -4.3279 2.0307 -2.0252
dipole: 5.1919
quadrupole: -70.8662 -106.3605 -107.6253
quadrupole: -7.5688 -6.1952 2.6802
quadrupole: 24.0845 -11.4098 -12.6746 -7.5688 -6.1952 2.6802
hfenergy: -886.0219002 hartree
pointgroup: C01 [X(C10H11N5O3)]
dipole: 1.7715308 -0.3817234 -0.9425819 debye
polarizability: 281.1186796|13.5220295|133.1634285|14.4811471|27.7442885|100.6470728 unknown
InChI: InChI=1S/C10H11N5O3/c1-3-18-9(17)6-8(16)15(2)7-5(13-6)4-12-10(11)14-7/h4H,3,11H2,1-2H3
charge 0 multiplicity 1
29 atoms
O  -3.067593 0.918115 -0.878793
O  -1.550224 -1.775928 -0.795641
O  -3.067541 0.802685 1.458017
N  0.718521 -1.177471 -0.58561
N  -0.125782 1.261951 0.636668
N  2.989441 -0.566767 -0.287683
N  3.554752 1.575294 0.804189
N  5.206137 0.104206 0.047013
C  1.671368 -0.269979 -0.132403
C  1.21931 0.947178 0.487686
C  -0.687467 -0.924927 -0.437126
C  -1.015073 0.387031 0.185131
C  1.14939 -2.446519 -1.213636
C  2.236171 1.834055 0.93846
C  -2.481117 0.7120 0.358058
C  3.871922 0.369521 0.187376
C  -4.5492 1.152705 -0.890435
C  -5.296657 -0.182835 -0.871816
H  1.762424 -3.027454 -0.505883
H  1.757749 -2.23465 -2.107532
H  0.240002 -3.002555 -1.483411
H  1.947186 2.774576 1.419095
H  -4.810477 1.780876 -0.020582
H  -4.709157 1.709997 -1.826761
H  -6.381757 -0.001998 -0.986289
H  -4.959257 -0.831156 -1.69779
H  -5.131836 -0.71289 0.080751
H  5.503957 -0.761677 -0.395335
H  5.879009 0.784017 0.393579
