program: Gaussian 09
title: 000252169
version: EM64L-G09RevD.01
frameworkgroup: C1[X(C10H10N4O3)]
method: RPBEPBE
basis: SDD
operation: Freq
keyword: #p
keyword: freq=noraman
keyword: PBEPBE/SDD
title: #p freq=noraman PBEPBE/SDD
converged: NO YES NO NO
title: Mulliken charges:
elementType: O O O N N N N C C C C C C C C C C H H H H H H H H H H
charge: -0.242882 -0.207957 -0.205656 -0.158693 0.072358 -0.038125 0.007623 0.174776 0.068345 0.137023 -0.087740 -0.613038 0.179647 -0.338767 -0.208550 -0.353062 -0.670425 0.259100 0.260399 0.273742 0.279190 0.233231 0.238355 0.258705 0.213984 0.236668 0.231749
chargesum: 0.00000
title: Mulliken charges with hydrogens summed into heavy atoms:
elementType: O O O N N N N C C C C C C C C C C
charge: -0.242882 -0.207957 -0.205656 -0.158693 0.072358 -0.038125 0.007623 0.174776 0.068345 0.137023 -0.087740 0.180203 0.179647 -0.059577 0.263036 -0.094358 0.011976
polarizability: 2.23640074e+02 -2.07482916e+01 1.44752762e+02 -1.35994975e+01 -1.22851990e+00 8.92834925e+01
1716.lowfreq: -13.9574 -4.4007 -0.0005 -0.0004 0.0005 4.7072 10.9214 41.6740 46.6838
frequency: -7.6667 41.5832 46.5598 76.8333 90.6163 99.0780 119.9930 155.7294 182.3116 238.9625 252.4475 257.4175 275.1754 295.8925 340.9044 364.4768 366.7835 442.5823 489.1235 500.1531 525.9930 550.7679 590.4178 617.6778 667.2061 731.9250 747.8364 758.3864 794.7205 797.8484 818.6144 852.2040 884.4332 914.2081 959.9336 960.3042 1014.9238 1065.0922 1098.5033 1113.7176 1122.9464 1125.8011 1132.4449 1179.8274 1214.5292 1248.9747 1255.7544 1275.2182 1299.5740 1344.9625 1356.2302 1383.0179 1400.4508 1406.8508 1443.6970 1462.5878 1470.7906 1471.9285 1473.4800 1484.5825 1498.7111 1532.9963 1540.7058 1600.7601 1634.5569 2997.9374 3016.5575 3021.1839 3077.4695 3094.9377 3111.8946 3117.5959 3145.2161 3157.9655 3174.4950
redmass: 3.8539 3.5479 4.8576 3.2381 1.3857 2.8514 3.7955 5.2320 2.4683 4.8750 3.9688 1.6854 6.9038 4.8304 4.3877 5.2472 3.8198 11.3341 6.3181 5.7452 8.3187 8.8491 4.2939 8.6861 8.0469 9.4768 9.2776 6.6716 4.2825 1.1413 5.9208 9.9050 5.3225 1.5600 1.5205 3.7434 2.2316 6.1148 4.0066 2.2794 1.3362 3.6049 1.4593 3.6090 3.9764 1.1490 7.8392 7.4813 1.8408 3.0882 1.4435 2.3215 1.2635 1.4643 1.7896 1.0398 1.2416 1.0764 1.0494 1.0637 4.8008 7.4408 10.1420 10.8905 11.9831 1.0358 1.0580 1.0324 1.1067 1.0985 1.1033 1.1020 1.1032 1.0931 1.0935
irintensity: 0.8787 1.2711 1.5909 1.0151 1.0769 1.1566 2.2089 0.2618 1.9916 10.6738 1.7657 0.5839 3.4900 4.0851 7.1389 10.6890 1.3320 5.8718 13.7864 1.4249 11.4985 10.8413 9.1117 22.0156 5.4961 1.5059 18.6386 5.0073 8.2939 4.5352 6.7388 8.8357 3.7302 17.9002 0.9452 80.5495 64.8299 196.1268 4.2868 7.6009 1.4937 134.3923 7.9389 53.2463 4.2920 0.4376 72.4589 146.4266 14.0528 17.1343 1.1961 30.6072 21.1400 3.9015 40.7137 13.4118 35.8897 8.5339 20.6920 12.9995 62.5667 219.3684 85.2450 207.0903 172.6472 18.6017 16.5745 12.6824 3.5915 27.6420 36.0884 9.3810 1.1105 4.3057 10.2430
temp: 298.150 k
press: 1.00000 atm
elementType: 8 8 8 7 7 7 7 6 6 6 6 6 6 6 6 6 6 1 1 1 1 1 1 1 1 1 1
symmnumber: 1
zpe: 516655.0 jmol-1
zpe.correction: 0.196783 hartree
zpe.thermalcorrener: 0.211598 hartree
zpe.thermalcorrenthalpy: 0.212542 hartree
zpe.thermalcorrgfe: 0.153833 hartree
zpe.sumelectzpe: -830.507749 hartree
zpe.sumelectthermal: -830.492935 hartree
zpe.sumelectthermalent: -830.491991 hartree
zpe.sumelectthermalfe: -830.550699 hartree
dipole: -0.0425 0.9251 -2.2921
dipole: 2.4721
quadrupole: -86.8605 -100.2615 -103.1008
quadrupole: 10.0439 7.4432 0.3803
quadrupole: 9.8804 -3.5206 -6.3599 10.0439 7.4432 0.3803
hfenergy: -830.7045323 hartree
pointgroup: C01 [X(C10H10N4O3)]
dipole: 0.0086976 -0.2278259 0.9454969 debye
polarizability: 224.8590167|20.8913627|142.4968062|6.1337404|-10.0206461|90.3205058 unknown
InChI: InChI=1S/C10H10N4O3/c1-3-17-10(16)7-9(15)14(2)8-6(13-7)4-11-5-12-8/h4-5H,3H2,1-2H3
charge 0 multiplicity 1
27 atoms
O  -2.909547 0.457402 0.461211
O  -1.093822 -2.204173 0.01101
O  -2.637243 0.401556 -1.860395
N  1.109716 -1.387514 0.210025
N  0.096198 1.20768 -0.473716
N  3.31161 -0.505134 0.366489
N  3.723453 1.87022 -0.06287
C  1.980498 -0.304278 0.120323
C  1.456829 0.986391 -0.226636
C  -0.289059 -1.233663 -0.04326
C  -0.707085 0.162177 -0.381095
C  1.629105 -2.729689 0.564286
C  -2.176414 0.350096 -0.700204
C  2.393737 2.047325 -0.302793
C  -4.398051 0.598396 0.299822
C  4.108105 0.592436 0.261193
C  -4.98343 0.677919 1.704104
H  2.108526 -2.696872 1.555364
H  2.381362 -3.04747 -0.174711
H  0.77377 -3.420481 0.56876
H  2.048503 3.052551 -0.565024
H  -4.589077 1.507241 -0.29831
H  -4.757971 -0.278787 -0.266538
H  5.17357 0.441112 0.45637
H  -6.082201 0.780045 1.642679
H  -4.750405 -0.234081 2.279188
H  -4.583472 1.548894 2.250527
