program: Gaussian 09
title: 000252128
version: EM64L-G09RevD.01
frameworkgroup: C1[X(C8H9N3)]
method: RPBEPBE
basis: SDD
operation: Freq
keyword: #p
keyword: freq=noraman
keyword: PBEPBE/SDD
title: #p freq=noraman PBEPBE/SDD
converged: NO NO NO NO
title: Mulliken charges:
elementType: N N N C C C C C C C C H H H H H H H H H
charge: -0.310523 -0.118963 -0.148295 0.348377 0.172791 0.210018 -0.374417 -0.298740 -0.739277 -0.167271 -0.741861 0.231545 0.258561 0.236571 0.239305 0.236574 0.241069 0.226547 0.271408 0.226584
chargesum: 0.00000
title: Mulliken charges with hydrogens summed into heavy atoms:
elementType: N N N C C C C C C C C
charge: -0.310523 -0.118963 -0.148295 0.348377 0.172791 0.210018 -0.142873 -0.040180 -0.026828 0.073798 -0.017322
polarizability: 1.39664464e+02 1.75445087e+00 1.19462962e+02 -4.06774729e-03 -3.69147484e-03 5.18887137e+01
1716.lowfreq: -17.7063 -7.1724 -0.0004 0.0006 0.0010 12.3861 64.3934 111.3846 192.2821
frequency: 63.9268 111.2635 192.2740 224.1414 238.5615 262.1753 309.2094 313.6486 479.1164 492.4452 504.4012 581.4840 581.9271 630.5939 650.5268 713.6607 736.7637 784.8733 835.7778 884.3425 952.1305 970.7103 976.0914 1024.0417 1032.9777 1040.4142 1050.1609 1073.9331 1085.0086 1158.9051 1238.2353 1261.3976 1314.6245 1331.8025 1385.5816 1398.8482 1408.3955 1450.3242 1458.8591 1468.5745 1479.0197 1483.2671 1506.0295 1544.5749 1634.7194 2987.1856 2996.9545 3067.1713 3080.3465 3106.0422 3112.8248 3154.6473 3171.6820 3193.0288
redmass: 1.7566 1.3931 2.3444 3.9765 1.2812 3.0331 4.0840 2.8041 5.0262 4.6663 3.7602 5.0291 3.5417 4.7828 7.4457 6.1538 3.2463 1.5374 4.7715 1.3508 2.3553 1.3094 2.0999 6.1028 3.9838 1.4637 1.4755 1.6378 2.7255 1.5722 3.8473 1.8311 4.3278 2.5711 2.0600 1.3516 1.3085 2.5570 1.0462 1.5944 1.0452 1.1825 3.4329 7.4050 6.6442 1.0380 1.0372 1.0989 1.0983 1.0984 1.0970 1.0881 1.0936 1.0982
irintensity: 0.3839 1.3963 6.0210 0.5031 1.4363 1.5038 0.5204 2.2624 0.5466 3.1985 0.0002 0.9658 0.0661 1.6947 0.5336 2.5298 14.2241 65.5382 0.3645 0.0375 0.0687 0.5814 1.4488 4.2866 15.6934 0.5345 8.5091 12.5624 5.5122 7.3932 7.1768 0.3469 29.1297 18.5384 15.2888 0.3837 26.6311 7.2307 1.5703 31.0722 39.7950 0.6122 9.9215 17.2098 17.0604 0.8617 43.2698 0.3455 31.7133 17.2556 1.4453 8.7839 8.4436 5.0299
temp: 298.150 k
press: 1.00000 atm
elementType: 7 7 7 6 6 6 6 6 6 6 6 1 1 1 1 1 1 1 1 1
symmnumber: 1
zpe: 413845.8 jmol-1
zpe.correction: 0.157626 hartree
zpe.thermalcorrener: 0.167021 hartree
zpe.thermalcorrenthalpy: 0.167965 hartree
zpe.thermalcorrgfe: 0.123079 hartree
zpe.sumelectzpe: -473.693235 hartree
zpe.sumelectthermal: -473.683840 hartree
zpe.sumelectthermalent: -473.682896 hartree
zpe.sumelectthermalfe: -473.727781 hartree
dipole: 2.2452 6.2018 0.0011
dipole: 6.5957
quadrupole: -58.6541 -69.5430 -66.7782
quadrupole: -9.0689 -0.0032 -0.0001
quadrupole: 6.3377 -4.5513 -1.7864 -9.0689 -0.0032 -0.0001
hfenergy: -473.8508606 hartree
pointgroup: C01 [X(C8H9N3)]
dipole: -1.3399278 -2.2222454 0.0004211 debye
dipolederiv: -0.1859268 0.094964 0.0001377 -0.3130216 -0.6189476 0.0000138 -0.0000995 -0.0000468 0.0451052 -0.4696378 0.2242333 -0.0000015 -0.1877506 -0.257433 0.0004662 0.0000519 -0.0004593 -0.2376868 -0.1892914 -0.2045588 -0.0004918 0.0791668 0.0451894 -0.0001626 -0.0004535 0.0003122 -0.2610883 0.2647761 -0.131142 -0.000061 0.0961829 0.4210994 -0.000002 0.0000945 -0.0000048 0.0155288 0.1885045 0.0647673 0.000321 0.4430195 0.1826919 0.0000082 0.0001052 -0.0000499 0.0972744 0.3094195 -0.1879389 0.0001214 -0.1739 0.1707488 -0.0004276 0.0000028 0.0002438 0.010318 -0.0839248 0.2206361 0.0000853 -0.0188107 -0.0964784 -0.0000318 -0.000134 0.0000749 -0.2048041 -0.0219473 -0.0357355 -0.0001083 -0.0505419 0.0326513 0.0000045 0.0001908 0.0001716 -0.134701 0.0037731 0.095939 -0.0000051 0.0022667 -0.1223312 -0.0000118 0.0000624 -0.0000353 0.0778082 0.040869 -0.1082937 -0.0000205 0.0258429 0.1024769 0.0000818 -0.0001676 -0.0001244 -0.1401624 -0.0215334 0.0146984 0.0000595 0.0689651 -0.0389971 0.0001143 0.0001897 0.0000791 0.1133774 0.0235653 -0.085701 -0.0000011 -0.1043246 -0.0268432 -0.0000211 -0.0000088 -0.0000073 0.1630624 0.0904751 0.0075433 0.0000049 0.0454755 -0.0116076 -0.0000321 0.0001092 -0.0000212 0.1730361 0.0468686 0.0693717 0.1067836 0.0300881 0.0267863 0.0006789 0.099312 -0.0517961 -0.0263139 -0.0668839 -0.1513541 -0.0000295 -0.0431803 0.0300943 -0.0000086 -0.0000189 -0.0000134 0.1203929 0.0469551 0.0693706 -0.1067473 0.0300867 0.02678 -0.0006702 -0.0992808 0.0518325 -0.0263686 -0.0888443 0.0613445 0.0000191 0.0417474 0.0783337 0.0000016 0.00001 -0.0000052 0.1644961 0.079227 -0.0015155 -0.0667909 0.0717208 -0.0193943 -0.0883101 -0.0087356 -0.1148369 -0.040266 -0.0457559 -0.0152174 0.0000293 -0.1146787 0.0942919 0.000043 0.0000926 -0.0000121 0.1313795 0.0793123 -0.0014115 0.066695 0.071646 -0.0191115 0.0882655 0.0086776 0.1146985 -0.0403877 unknown
polarizability: 139.5719381|-2.2223164|119.5554879|0.0047066|0.0028322|51.8887137 unknown
InChI: InChI=1S/C8H9N3/c1-6-4-3-5-8-10-9-7(2)11(6)8/h3-5H,1-2H3
charge 0 multiplicity 1
20 atoms
N  0.190638 -0.198584 -0.000009
N  0.967533 1.960607 0.000859
N  2.055386 1.069836 -0.000986
C  -0.797041 -1.202659 -0.00017
C  -0.160162 1.195097 0.000039
C  1.598931 -0.210905 0.000253
C  -2.126009 -0.791643 -0.000255
C  -1.527876 1.586028 0.000045
C  -0.397582 -2.659592 -0.00017
C  -2.504923 0.596074 -0.000136
C  2.524721 -1.389707 0.000561
H  -2.897953 -1.566331 -0.000263
H  -1.759382 2.653499 0.000344
H  0.197281 -2.926209 -0.891937
H  -1.305742 -3.282912 -0.000308
H  0.197055 -2.92628 0.891724
H  -3.565542 0.864066 -0.000002
H  2.408949 -2.026769 -0.894073
H  3.548979 -0.984157 0.000112
H  2.409438 -2.026058 0.895772
