program: Gaussian 09
title: 000252142
version: EM64L-G09RevD.01
frameworkgroup: C1[X(C20H19N3O2)]
method: RPBEPBE
basis: SDD
operation: Freq
keyword: #p
keyword: freq=noraman
keyword: PBEPBE/SDD
title: #p freq=noraman PBEPBE/SDD
converged: YES YES NO NO
title: Mulliken charges:
elementType: O O N N N C C C C C C C C C C C C C C C C C C C C H H H H H H H H H H H H H H H H H H H
charge: -0.206730 -0.207009 -0.246990 -0.238489 -0.018118 -0.339396 -0.402600 0.112273 0.116715 -0.361484 -0.376597 0.460914 0.460653 -0.431858 -0.378844 -0.375206 -0.352440 -0.350961 -0.212077 -0.211554 -0.204825 -0.206816 -0.247861 -0.247785 -0.156035 0.293803 0.236366 0.234757 0.220312 0.208441 0.224745 0.223158 0.251543 0.248070 0.278936 0.278013 0.264985 0.263828 0.232111 0.232661 0.231858 0.231969 0.233616 0.233946
chargesum: 0.00000
title: Mulliken charges with hydrogens summed into heavy atoms:
elementType: O O N N N C C C C C C C C C C C C C C C C C C C C
charge: -0.206730 -0.207009 -0.246990 -0.238489 -0.018118 -0.045593 0.068524 0.112273 0.116715 0.067269 0.071305 0.460914 0.460653 0.067755 -0.099908 -0.097193 -0.087454 -0.087133 0.020034 0.021107 0.027033 0.025153 -0.014245 -0.013839 -0.156035
polarizability: 2.70202517e+02 -1.22431159e+01 2.41054030e+02 2.90901070e+01 1.27122609e+01 1.96399823e+02
1716.lowfreq: -1.6468 -0.0002 0.0004 0.0006 5.6907 6.9669 17.9398 18.8319 39.1732
frequency: 17.5980 18.8140 39.1333 49.9658 53.0103 60.7380 70.1324 75.7031 85.9230 94.1993 119.7035 123.0642 132.7363 212.0035 215.6227 237.5520 250.8107 265.4192 289.9698 324.6730 341.0123 372.7369 373.6188 388.5663 405.8667 407.5171 433.2568 470.2330 501.8118 507.5244 538.1948 572.4302 587.2133 611.6852 613.5744 634.6648 657.8667 682.1995 693.2085 698.0368 733.7874 756.9479 759.1859 778.4873 786.9880 837.3124 837.6876 853.7581 860.0482 887.1368 912.3731 913.1046 924.8388 962.8656 970.4611 971.5880 987.1795 987.9872 993.2535 993.7371 994.8261 1025.8663 1026.1709 1036.4545 1061.7941 1071.1377 1082.3837 1089.7177 1098.0934 1120.7784 1135.5632 1162.5446 1175.1495 1175.2933 1185.1294 1190.9727 1191.5358 1218.8948 1221.3507 1256.9531 1262.1795 1288.6527 1290.2685 1294.7754 1307.7418 1310.7230 1323.4702 1337.9896 1345.9806 1368.4929 1383.1747 1385.7836 1443.0272 1447.3117 1448.0589 1452.7473 1467.1690 1479.6043 1481.1891 1482.7081 1592.0768 1594.3727 1604.0247 1608.1646 1634.8238 1665.2614 2198.9579 2964.9144 2986.4150 2995.1881 2998.9185 3008.6892 3014.2817 3036.6411 3061.1120 3072.1934 3134.3128 3134.4699 3145.2250 3145.3329 3161.5744 3162.2283 3172.9183 3173.9424 3190.1741 3190.9436
redmass: 7.1494 6.9715 3.4833 3.6651 3.9038 3.9820 4.5879 5.5275 7.0259 3.4373 4.6538 2.7252 4.4516 5.2623 2.8877 4.9125 5.1521 4.8925 7.9727 6.4031 5.2681 3.8654 5.4084 8.4708 2.8947 2.8884 6.0201 5.7149 3.4827 3.8167 6.2764 6.8808 5.3951 6.4165 6.2394 7.2355 6.0508 2.9249 2.1887 1.9273 1.1394 1.6042 1.6430 2.0684 2.8614 1.2723 1.2499 6.7280 4.7459 1.7382 1.3952 1.4115 5.1175 2.4190 1.4116 1.3808 5.9907 5.3634 1.3143 1.3338 3.3085 2.4841 2.2650 3.4306 3.0358 2.4538 1.7488 2.2637 1.6377 2.9717 1.6762 1.7844 1.0489 1.0543 1.4269 1.1184 1.1416 1.5397 4.7047 1.4097 1.2990 5.0835 2.9058 1.1041 1.2794 1.2498 1.3338 1.5690 1.4119 1.5501 8.6888 10.3811 2.2998 1.0860 2.3529 1.0873 1.0750 2.2814 1.1013 2.2903 6.4060 6.6101 6.1373 5.9896 12.0425 11.8269 12.4346 1.0590 1.0591 1.0622 1.0644 1.0736 1.1003 1.1014 1.1047 1.1048 1.0854 1.0854 1.0901 1.0900 1.0946 1.0948 1.0982 1.0979 1.0964 1.0963
irintensity: 0.6138 0.4078 5.4270 1.5151 0.4758 0.4769 0.1576 2.1644 8.2536 1.5537 1.9798 1.4168 0.0287 1.3045 1.0178 4.3195 4.2768 0.8983 10.0483 2.0906 3.2243 0.1093 0.8930 0.1545 1.6252 0.9433 9.7688 23.9788 4.9120 11.2819 5.0813 15.1576 0.7894 1.0620 0.1310 8.9578 0.6012 2.2678 14.4471 68.6879 8.0347 71.9115 61.9079 0.1989 15.7516 1.4606 0.3789 0.5337 1.4867 0.4711 3.2445 5.3169 0.3680 1.4452 1.1420 0.2252 0.2123 0.5066 0.1431 0.3124 5.8096 3.9135 11.7371 9.1015 3.8393 0.2415 9.3633 18.3796 4.1184 20.5937 4.1928 11.1656 0.0038 0.3604 2.1944 1.6465 1.6095 0.3978 156.5448 50.0698 0.8708 320.8003 35.9855 2.3271 14.3115 11.9695 1.0966 1.9097 4.3845 1.2687 2.9878 0.5508 8.2517 15.0539 15.0849 9.3189 0.0730 54.6681 21.0101 99.4262 3.5270 7.5741 8.2246 62.1489 297.0118 222.4724 15.9841 14.4754 0.6015 0.7982 54.9265 17.2578 5.1791 0.1267 1.7830 50.8564 0.2617 0.2400 15.2104 9.3665 32.2466 25.5582 7.9755 8.2011 0.9550 1.0788
temp: 298.150 k
press: 1.00000 atm
elementType: 8 8 7 7 7 6 6 6 6 6 6 6 6 6 6 6 6 6 6 6 6 6 6 6 6 1 1 1 1 1 1 1 1 1 1 1 1 1 1 1 1 1 1 1
symmnumber: 1
zpe: 907400.6 jmol-1
zpe.correction: 0.345611 hartree
zpe.thermalcorrener: 0.368348 hartree
zpe.thermalcorrenthalpy: 0.369292 hartree
zpe.thermalcorrgfe: 0.290300 hartree
zpe.sumelectzpe: -1086.434734 hartree
zpe.sumelectthermal: -1086.411997 hartree
zpe.sumelectthermalent: -1086.411053 hartree
zpe.sumelectthermalfe: -1086.490044 hartree
dipole: -6.4756 1.1182 -0.7079
dipole: 6.6094
quadrupole: -183.5326 -147.7172 -142.2934
quadrupole: -4.2587 13.2296 -1.4871
quadrupole: -25.6849 10.1305 15.5543 -4.2587 13.2296 -1.4871
hfenergy: -1086.7803446 hartree
pointgroup: C01 [X(C20H19N3O2)]
dipole: -2.5180561 -0.5782225 0.2947166 debye
polarizability: 268.4722928|13.6175914|242.6516409|-30.1931006|10.6883587|196.5324364 unknown
InChI: InChI=1S/C20H19N3O2/c21-15-9-3-8-14-18-19(24)22(16-10-4-1-5-11-16)23(20(18)25)17-12-6-2-7-13-17/h1-2,4-7,10-13,18H,3,8-9,14H2
charge 0 multiplicity 1
44 atoms
O  0.056196 2.976277 -0.616505
O  0.923992 -1.439373 -2.4266
N  -0.911318 0.821633 -0.385526
N  -0.661294 -0.495366 -0.936208
N  7.485013 0.449803 1.695887
C  0.906439 1.006523 -1.902945
C  2.432057 1.137102 -1.650129
C  0.025732 1.752859 -0.899363
C  0.421845 -0.443308 -1.848757
C  2.88454 0.593438 -0.277552
C  4.407565 0.748096 -0.078339
C  -2.211984 1.161411 0.13064
C  -1.055448 -1.674291 -0.208542
C  4.86002 0.195282 1.302212
C  -2.317648 2.221401 1.065579
C  -1.244957 -2.881646 -0.925537
C  -3.3689 0.470116 -0.30818
C  -1.219205 -1.638489 1.198912
C  -3.591072 2.590121 1.549843
C  -1.5900 -4.055431 -0.221923
C  -4.631791 0.841518 0.198379
C  -1.580842 -2.817197 1.884267
C  -4.751077 1.9017 1.126458
C  -1.765266 -4.029964 1.180893
C  6.309576 0.330748 1.52731
H  0.688557 1.430517 -2.903431
H  2.953797 0.592772 -2.45953
H  2.69503 2.208157 -1.736817
H  2.610374 -0.477578 -0.19247
H  2.350967 1.134329 0.53059
H  4.948535 0.210942 -0.880325
H  4.6928 1.814571 -0.155846
H  4.588252 -0.874868 1.386665
H  4.326584 0.726553 2.114386
H  -1.421451 2.75699 1.385638
H  -1.104788 -2.899731 -2.008532
H  -3.284267 -0.342572 -1.034855
H  -1.068774 -0.705271 1.74878
H  -3.672116 3.415542 2.2652
H  -1.727955 -4.989897 -0.776248
H  -5.523992 0.302937 -0.13877
H  -1.713347 -2.786455 2.971149
H  -5.734701 2.186776 1.514306
H  -2.043181 -4.942379 1.718937
