program: Gaussian 09
title: 000252093
version: EM64L-G09RevD.01
frameworkgroup: C1[X(C8H9N3O2)]
method: RPBEPBE
basis: SDD
operation: Freq
keyword: #pfreq=noraman
keyword: PBEPBE/SDD
title: #p freq=noraman PBEPBE/SDD
converged: YES YES NO NO
title: Mulliken charges:
elementType: O O N N N C C C C C C C C H H H H H H H H H
charge: -0.309239 -0.301050 -0.346093 -0.301652 0.001439 0.253062 0.211525 -0.257192 -0.421696 -0.188567 0.282508 -0.318544 -0.753782 0.229515 0.351593 0.287389 0.353901 0.237890 0.248606 0.259120 0.222132 0.259134
chargesum: 0.00000
title: Mulliken charges with hydrogens summed into heavy atoms:
elementType: O O N N N C C C C C C C C
charge: -0.309239 -0.301050 0.005501 0.052249 0.001439 0.253062 0.211525 -0.027677 -0.134307 0.049323 0.282508 -0.069938 -0.013396
polarizability: 1.92565421e+02 -1.28621857e+00 1.18563599e+02 -1.71182919e+00 1.74841431e+00 5.22846642e+01
1716.lowfreq: -11.1803 -6.0701 -1.2823 -0.0006 -0.0005 -0.0004 16.7215 60.2328 72.7242
frequency: 16.5279 60.2103 72.6900 90.4378 100.5745 164.2003 198.9271 253.0536 289.0141 310.7709 378.9111 409.7383 436.7116 484.1043 558.4886 603.3378 610.6365 626.5744 632.0627 688.8530 700.3891 716.8363 818.6919 827.2859 929.4727 959.8528 968.0534 979.6086 986.1735 1001.9763 1024.9151 1043.7053 1071.2309 1128.6173 1190.8574 1201.9880 1227.8368 1283.1661 1308.4296 1332.0728 1395.7944 1396.1600 1420.5957 1448.1547 1457.2211 1472.1916 1524.2739 1532.0585 1563.6403 1583.5963 1604.8187 3001.1307 3099.2331 3106.9116 3131.0050 3139.6280 3158.0731 3171.2921 3491.8241 3507.4128
redmass: 5.4238 3.6281 5.2193 1.5322 2.7050 4.1241 4.8997 6.7749 4.2029 6.6446 2.9767 4.8700 4.4413 4.9839 2.2303 1.2785 5.2994 3.5410 1.7031 7.1756 3.8115 1.7697 1.8041 7.4892 1.3624 1.4809 2.8254 2.2748 1.4306 3.3019 3.9558 1.5867 2.3802 1.7562 3.3579 1.2834 1.5532 2.2623 9.7560 1.2790 1.9340 1.3599 2.3496 1.0445 2.0196 1.2815 3.1701 3.9485 6.8564 5.7400 6.2035 1.0359 1.0981 1.1010 1.0887 1.0912 1.0925 1.0997 1.0793 1.0799
irintensity: 1.9267 2.0407 7.7020 2.3653 9.9791 5.0544 18.3650 0.0874 0.7881 2.2591 2.8387 2.5294 13.7190 24.9603 9.8736 152.8137 17.9385 18.9191 14.7831 3.3678 15.1462 65.5835 25.8503 5.9814 0.9500 4.7847 4.7180 1.1229 0.2798 18.8563 0.1637 16.0626 5.1975 8.9316 3.4451 10.7007 14.0634 2.5806 2.7157 1.6333 400.6837 26.8049 351.2169 17.0546 48.6424 45.1929 96.8961 101.7841 220.0323 27.8212 29.3930 8.4889 6.2423 16.1479 4.5680 17.2813 2.6760 18.8520 22.0434 154.1901
temp: 298.150 k
press: 1.00000 atm
elementType: 8 8 7 7 7 6 6 6 6 6 6 6 6 1 1 1 1 1 1 1 1 1
symmnumber: 1
zpe: 435991.0 jmol-1
zpe.correction: 0.166060 hartree
zpe.thermalcorrener: 0.178303 hartree
zpe.thermalcorrenthalpy: 0.179248 hartree
zpe.thermalcorrgfe: 0.125500 hartree
zpe.sumelectzpe: -623.999998 hartree
zpe.sumelectthermal: -623.987754 hartree
zpe.sumelectthermalent: -623.986810 hartree
zpe.sumelectthermalfe: -624.040558 hartree
dipole: 1.8315 -1.7012 -0.3738
dipole: 2.5275
quadrupole: -68.9101 -81.6557 -77.6467
quadrupole: 19.9791 0.1153 1.7124
quadrupole: 7.1607 -5.5848 -1.5759 19.9791 0.1153 1.7124
hfenergy: -624.1660579 hartree
pointgroup: C01 [X(C8H9N3O2)]
dipole: -0.7362849 -0.6441618 0.1783145 debye
dipolederiv: -0.6654349 0.2230721 0.0012791 -0.3069415 -0.9910563 -0.0440102 -0.0201729 -0.0238929 -0.3727439 -0.6431221 0.1446621 0.0131296 -0.5466446 -1.0348554 -0.0509532 -0.0362539 -0.0447223 -0.3877323 -0.7652966 -0.3007513 -0.0289324 -0.6549885 -0.5164525 -0.0005256 -0.0553796 0.0083914 -0.2677568 -1.0813624 -0.353803 -0.022695 -0.5812041 -0.5359712 -0.0305451 -0.0276319 -0.0243692 -0.2890225 -0.3831737 0.0637599 -0.0031577 0.0968138 -0.3497803 0.0147349 -0.0016702 0.0163719 -0.2490888 -0.2088158 0.0107044 0.0302812 0.1676811 -0.2485363 0.0187829 0.0518332 0.0278406 0.0356858 1.524618 0.0494123 0.0193199 0.5643289 1.2546354 0.0812035 0.0379119 0.0354644 0.2261501 0.0765688 0.0147493 -0.0361215 -0.0697152 0.0956578 -0.0368577 -0.0472552 -0.0320567 -0.1013376 0.1286775 0.0363963 -0.0258223 -0.0065356 0.2525517 -0.0525377 -0.0025258 -0.0499171 -0.0316324 -0.3467865 0.0215488 0.0184926 -0.1532672 0.0832416 -0.0202115 0.0355382 -0.0300928 -0.0944747 1.5677062 0.2159872 0.017845 0.968462 1.357349 0.0891239 0.077049 0.079672 0.2044291 0.3445506 -0.1404488 -0.0189469 0.0566021 0.1422379 -0.0399857 -0.0534244 -0.0232824 -0.0551963 -0.3929571 0.1285348 0.0088351 0.0772359 -0.0171402 -0.0011442 -0.0018701 -0.0010305 0.0087965 -0.0191227 -0.0992487 0.0344104 -0.0948548 0.0489012 0.0249279 0.0407316 0.0173757 0.1311987 0.3276661 -0.0287759 -0.0052261 0.1816882 0.1975878 -0.0070362 0.0138328 -0.0092762 0.342456 0.1327074 0.0363453 -0.0031597 0.0432865 0.0117293 0.0218627 -0.0284099 0.0178891 0.1342775 0.2653732 -0.0654644 -0.002471 0.0858938 0.2302315 -0.0062692 -0.0004887 -0.0026625 0.3550297 0.0749926 0.0288035 0.002934 0.066758 -0.0816768 0.037612 -0.0003714 0.0409974 0.1544731 -0.0812455 0.0889975 0.0049435 0.0720932 0.0587294 0.0077972 0.0147729 0.0028178 0.1368461 0.0406475 -0.0157158 0.0628819 -0.0094409 0.0770876 0.0741614 0.1074011 0.0505469 0.0074062 0.0636755 -0.0519733 -0.0040835 0.0351685 -0.1277402 -0.0190479 0.0024484 -0.0181712 0.1233094 0.0401338 -0.0067922 -0.0637361 0.0075803 0.093269 -0.0610822 -0.1060651 -0.0378935 -0.011073 unknown
polarizability: 192.5454372|-0.7363742|118.3122175|-2.8570587|-4.2816689|52.5560296 unknown
InChI: InChI=1S/C8H9N3O2/c1-6(12)10-11-8(13)7-3-2-4-9-5-7/h2-5,10-11H,1H3
charge 0 multiplicity 1
22 atoms
O  -0.260266 2.080997 0.03617
O  -3.316335 -1.593238 -0.162983
N  -1.148347 -0.036774 -0.05126
N  -2.430399 0.520739 -0.017269
N  3.695291 0.606975 -0.331252
C  1.292789 0.192175 -0.041947
C  -0.064091 0.818377 -0.013007
C  1.545171 -1.188225 0.170763
C  2.405006 1.043742 -0.282585
C  2.875078 -1.654954 0.122362
C  -3.513325 -0.336294 -0.078821
C  3.913198 -0.728144 -0.132187
C  -4.87831 0.320076 -0.039046
H  0.736618 -1.893823 0.394343
H  -1.165701 -1.057842 -0.147721
H  2.235433 2.114177 -0.436321
H  -2.42901 1.544864 0.038476
H  3.107518 -2.71144 0.286026
H  4.959045 -1.052508 -0.174367
H  -5.446867 -0.075601 0.81996
H  -4.826216 1.418941 0.042269
H  -5.436679 0.054981 -0.953301
