program: Gaussian 09
title: 000252130
version: EM64L-G09RevD.01
frameworkgroup: C1[X(C14H17BrN6O)]
method: RPBEPBE
basis: SDD
operation: Freq
keyword: #p
keyword: freq=noraman
keyword: PBEPBE/SDD
title: #p freq=noraman PBEPBE/SDD
converged: NO YES NO NO
title: Mulliken charges:
elementType: Br O N N N N N N C C C C C C C C C C C C C C H H H H H H H H H H H H H H H H H
charge: 0.005046 -0.272758 -0.208980 -0.132052 -0.104595 -0.036604 -0.602745 -0.575980 -0.396585 -0.349512 -0.340937 0.473148 0.205475 -0.697374 -0.107277 -0.334200 -0.359881 0.163794 -0.163550 -0.168204 -0.236580 -0.034512 0.241553 0.212736 0.229841 0.204568 0.193473 0.196669 0.211823 0.217270 0.215397 0.257811 0.244757 0.248442 0.248790 0.326254 0.357301 0.331414 0.336764
chargesum: 0.00000
title: Mulliken charges with hydrogens summed into heavy atoms:
elementType: Br O N N N N N N C C C C C C C C C C C C C C
charge: 0.005046 -0.272758 -0.208980 -0.132052 -0.104595 -0.036604 0.080811 0.092198 0.057704 0.084897 0.049205 0.473148 0.205475 -0.052884 -0.107277 -0.076389 -0.115125 0.163794 0.084892 0.080586 -0.236580 -0.034512
polarizability: 3.48784071e+02 1.16682298e+00 2.20187823e+02 2.39710997e+01 1.36474047e+01 1.52997691e+02
1716.lowfreq: -7.0625 -0.0006 0.0002 0.0006 3.3786 6.2300 24.0676 26.9263 39.1141
frequency: 23.7646 26.8318 39.0994 44.0194 59.6632 61.7685 76.3083 113.1680 127.0366 155.4427 167.3165 192.0451 192.7520 198.8719 226.8939 227.9445 252.9404 265.4554 278.6402 308.9821 320.8508 360.6451 371.1245 390.5553 408.7282 425.6761 467.1643 488.1505 495.0041 515.5250 548.0445 551.5524 557.6484 605.8711 617.3500 623.0974 664.1428 669.3233 687.9335 701.9131 716.8048 735.8069 763.2904 777.2621 784.6066 812.3448 818.0684 825.5968 899.4567 921.0710 942.4196 954.0960 957.4412 979.9810 991.4487 1024.0514 1047.8570 1061.3940 1070.7853 1112.1921 1113.2920 1125.9459 1137.6227 1171.6398 1184.2258 1210.2518 1219.3189 1263.8670 1272.4570 1278.0485 1289.6748 1292.2437 1317.9035 1336.3197 1344.7330 1362.2502 1367.2582 1388.8967 1396.7278 1413.8068 1432.7560 1455.8574 1468.8360 1471.8309 1475.4961 1476.5972 1487.3421 1491.2795 1501.3636 1538.3942 1578.7103 1590.4005 1593.3079 1617.4897 2963.3389 2974.4562 2986.0051 3008.1250 3017.2347 3050.3523 3071.7635 3074.0895 3097.0802 3147.9322 3153.2384 3171.3112 3175.8838 3488.3201 3554.2666 3667.4304 3714.3769
redmass: 4.4203 6.1786 5.3694 5.8270 2.0672 2.5316 7.0998 2.5186 6.3209 5.3765 7.5503 6.2986 7.9584 6.3893 1.2310 5.0187 4.6139 4.8570 3.9999 3.1004 5.6486 4.5281 3.8104 3.4059 2.9101 5.7013 3.5832 4.2360 1.2546 3.5454 1.7285 2.4176 1.1775 7.3139 4.3230 6.5572 4.7641 1.5112 2.8436 3.6524 8.4834 1.1214 3.6222 2.1261 6.8086 1.2976 2.0302 1.9065 1.7613 1.5845 1.3394 1.7064 1.4075 5.2825 4.5650 3.9008 3.2003 2.3217 2.5251 2.0846 1.4721 2.0660 2.0703 3.4731 1.1480 6.6394 1.5806 1.6285 1.4947 5.1012 1.1202 1.2513 1.7090 7.7671 1.4846 2.5908 2.0229 1.2177 3.7446 4.6381 2.4020 1.5138 1.0683 2.5287 1.0586 1.0642 1.1472 2.9057 2.0645 3.7927 7.5257 1.8170 6.2336 1.9738 1.0589 1.0362 1.0605 1.0981 1.0645 1.1000 1.1006 1.0995 1.1019 1.0889 1.0885 1.0963 1.0974 1.0464 1.0443 1.1028 1.1059
irintensity: 0.2013 0.2222 0.0841 1.4933 0.2224 0.1866 0.5118 0.0826 0.4445 6.9871 2.9446 2.9817 0.7412 6.8086 0.6786 6.5250 1.8484 3.3858 0.9310 7.8756 5.8893 4.3245 14.2511 7.6820 0.4509 0.6588 8.4128 15.5969 204.4465 22.6096 63.1094 20.1965 133.0381 16.9869 14.2589 3.1518 6.4921 29.1842 44.1689 5.0327 12.9328 7.6413 1.6390 10.4755 40.9885 0.3786 22.0785 33.8766 7.7555 16.9409 0.2904 4.1327 1.1563 1.1950 71.1056 6.8317 5.0503 40.4663 0.2301 12.0267 13.7308 20.5773 48.3763 7.9743 0.8362 22.6177 19.5201 19.3078 10.5581 206.8770 1.1022 4.2193 31.2450 88.2668 1.5490 48.9364 9.8254 10.8770 24.7314 106.6295 73.9445 41.3525 0.1751 238.1543 19.1766 8.9635 35.0507 441.2255 28.7256 649.9568 2.0814 715.5938 9.5017 313.1965 31.4374 33.3733 22.5360 10.0976 30.3434 9.9084 60.1853 53.8097 19.3756 4.8523 6.0860 6.4684 1.7226 80.7607 175.0003 73.3954 49.1885
temp: 298.150 k
press: 1.00000 atm
elementType: 35 8 7 7 7 7 7 7 6 6 6 6 6 6 6 6 6 6 6 6 6 6 1 1 1 1 1 1 1 1 1 1 1 1 1 1 1 1 1
symmnumber: 1
zpe: 793641.9 jmol-1
zpe.correction: 0.302282 hartree
zpe.thermalcorrener: 0.324082 hartree
zpe.thermalcorrenthalpy: 0.325027 hartree
zpe.thermalcorrgfe: 0.249083 hartree
zpe.sumelectzpe: -959.239594 hartree
zpe.sumelectthermal: -959.217794 hartree
zpe.sumelectthermalent: -959.216850 hartree
zpe.sumelectthermalfe: -959.292794 hartree
dipole: -5.0773 2.4583 -1.6985
dipole: 5.8912
quadrupole: -123.9826 -128.9738 -138.0554
quadrupole: 2.7427 5.6827 11.1248
quadrupole: 6.3546 1.3635 -7.7181 2.7427 5.6827 11.1248
hfenergy: -959.5418767 hartree
pointgroup: C01 [X(C14H17Br1N6O1)]
dipole: -1.1267636 -1.7852314 0.9568042 debye
polarizability: 309.1432739|52.7078887|253.5537426|-43.2589434|-16.4320098|159.2725684 unknown
InChI: InChI=1S/C14H17BrN6O/c1-2-3-8-21(10-6-4-9(15)5-7-10)13-11(20-22)12(16)18-14(17)19-13/h4-7H,2-3,8,16-17H2,1H3
charge 0 multiplicity 1
39 atoms
Br 4.794733 3.531851 -0.210858
O  -0.493768 2.032547 -1.947397
N  0.132718 -0.556418 -0.702798
N  -1.829881 -1.397427 0.261051
N  -3.692229 0.048687 0.969335
N  -1.514324 2.095753 -1.136367
N  -3.671077 2.328392 0.444803
N  -3.735373 -2.258193 1.288758
C  0.572221 -1.969341 -0.914645
C  1.231152 -2.601648 0.330875
C  1.733803 -4.034737 0.044703
C  1.170813 0.443087 -0.627299
C  -1.154586 -0.319103 -0.247777
C  2.398586 -4.684809 1.277285
C  -1.797371 0.985288 -0.327688
C  1.307879 1.228776 0.543834
C  2.127157 0.566779 -1.664436
C  -3.066272 1.107886 0.38707
C  2.367092 2.153432 0.665892
C  3.198244 1.4732 -1.544912
C  3.305864 2.261345 -0.378753
C  -3.06274 -1.162733 0.810061
H  -0.315283 -2.553964 -1.204547
H  1.286369 -1.971754 -1.758563
H  0.489065 -2.618483 1.151002
H  2.0802 -1.972057 0.663401
H  2.458625 -4.011263 -0.795078
H  0.883945 -4.662611 -0.292937
H  1.689363 -4.746868 2.123866
H  2.750127 -5.70875 1.054015
H  3.270616 -4.093504 1.613869
H  0.589432 1.120039 1.362487
H  2.007215 -0.005643 -2.588928
H  2.464963 2.762888 1.568684
H  3.923387 1.579398 -2.356488
H  -4.590144 2.408973 0.874143
H  -3.23655 3.092661 -0.077329
H  -3.307048 -3.177081 1.214065
H  -4.647421 -2.127296 1.7188
