program: Gaussian 09
title: 000252084
version: EM64L-G09RevD.01
frameworkgroup: C1[X(C6H8N4O2)]
method: RPBEPBE
basis: SDD
operation: Freq
keyword: #pfreq=noraman
keyword: PBEPBE/SDD
title: #p freq=noraman PBEPBE/SDD
converged: NO YES NO NO
title: Mulliken charges:
elementType: O O N N N N C C C C C C H H H H H H H H
charge: -0.283313 -0.288335 -0.402026 -0.389404 -0.070353 -0.657287 0.229172 0.276642 0.112879 -0.404390 0.255999 -0.783189 0.401104 0.348834 0.237921 0.272105 0.244299 0.243721 0.308038 0.347582
chargesum: 0.00000
title: Mulliken charges with hydrogens summed into heavy atoms:
elementType: O O N N N N C C C C C C
charge: -0.283313 -0.288335 -0.000921 -0.040570 -0.070353 -0.001667 0.229172 0.276642 0.112879 -0.166469 0.255999 -0.023063
polarizability: 1.80491798e+02 1.72265318e+00 1.09340453e+02 -3.01650572e-02 1.25497745e-02 4.65221927e+01
1716.lowfreq: -80.0096 -3.9376 -0.0010 -0.0008 -0.0007 3.0919 6.5831 72.9805 91.0180
frequency: -79.9865 72.9737 91.0180 143.8590 157.7959 217.1496 295.1797 304.5641 335.4621 364.3748 393.6283 434.8803 481.1330 530.2840 560.3538 566.5196 569.9487 638.2728 662.0732 710.2768 732.4900 756.9996 790.6423 859.2092 937.5901 943.9122 959.8985 1003.4166 1035.3859 1041.1292 1208.0338 1222.6093 1233.3914 1283.8410 1324.6236 1383.8401 1396.7718 1437.1439 1466.0432 1469.9854 1477.0736 1559.5002 1586.4679 1600.2701 1607.9806 1637.3868 2993.3092 3077.7977 3139.7696 3148.5484 3280.2429 3520.9262 3531.5958 3690.9123
redmass: 1.0378 4.1018 7.3362 5.3631 5.6352 6.0327 3.7311 3.9999 8.2525 1.4410 3.0377 3.4534 5.8719 5.1010 6.5386 1.1352 2.8385 5.6378 3.1079 1.5521 5.5836 7.3914 5.5431 1.4297 1.1278 6.0932 2.4370 1.8770 1.6347 1.6568 2.6420 3.0233 3.2099 2.2465 2.1927 1.2354 2.6499 1.4716 1.0457 1.7550 4.1830 2.3270 2.6995 4.9620 4.7248 2.5878 1.0385 1.0982 1.0982 1.0922 1.0809 1.0472 1.0774 1.1015
irintensity: 0.1367 4.3436 2.2307 6.3056 4.9479 0.1268 5.7357 2.7660 8.0561 108.7160 93.5865 7.8203 1.4748 25.1032 4.1463 109.4976 6.2951 0.7563 20.2026 86.6056 0.4109 10.7802 19.3661 35.6835 105.2523 7.4226 9.4980 43.1788 9.8120 14.9208 13.2021 4.7106 26.6572 114.6345 34.3180 39.8920 18.9922 144.1095 21.0664 83.4980 33.7015 310.6974 157.9272 509.9510 342.0013 75.0363 6.2630 11.0823 4.6625 35.3142 213.6399 128.1284 42.2700 51.3204
temp: 298.150 k
press: 1.00000 atm
elementType: 8 8 7 7 7 7 6 6 6 6 6 6 1 1 1 1 1 1 1 1
symmnumber: 1
zpe: 393981.0 jmol-1
zpe.correction: 0.150059 hartree
zpe.thermalcorrener: 0.160460 hartree
zpe.thermalcorrenthalpy: 0.161404 hartree
zpe.thermalcorrgfe: 0.114012 hartree
zpe.sumelectzpe: -602.053414 hartree
zpe.sumelectthermal: -602.043014 hartree
zpe.sumelectthermalent: -602.042070 hartree
zpe.sumelectthermalfe: -602.089461 hartree
dipole: -1.2438 -4.5073 0.0185
dipole: 4.6759
quadrupole: -44.5430 -80.4279 -71.6204
quadrupole: -0.0361 -0.0296 0.0274
quadrupole: 20.9874 -14.8974 -6.0900 -0.0361 -0.0296 0.0274
hfenergy: -602.2034736 hartree
pointgroup: C01 [X(C6H8N4O2)]
dipole: 0.7594038 -0.8320595 -1.4543714 debye
dipolederiv: -0.6991128 0.1564988 0.3243629 0.2746882 -0.5300455 -0.2902251 0.4952984 -0.2535419 -0.912818 -0.5761911 0.1002477 0.2216193 -0.3532738 -0.604217 -0.2641879 -0.4357676 -0.4153099 -0.7963752 -0.5959281 0.1315016 0.3139066 -0.1864847 -0.296328 -0.0593255 -0.1422174 -0.1627086 -0.3999545 -1.3866278 -0.41532 -0.2514343 -0.5392469 -0.5659385 -0.1732418 -0.4299423 -0.2133338 -0.4912813 -0.4508244 0.1556757 0.2904073 -0.2241669 -0.3111459 -0.0285866 -0.2516352 -0.1516662 -0.3764307 -1.731684 -0.1874282 0.0641982 -0.1781189 -0.5390344 0.2903857 0.0737815 0.2929536 -0.3092051 1.0017442 0.169653 -0.024422 0.2952385 0.3365496 0.1354235 0.1549929 0.1757107 0.3763515 1.5763714 0.2371173 -0.1297413 0.2522287 -0.0710669 -0.3565696 -0.1047226 -0.3509077 -0.3473795 0.6757766 -0.2050476 -0.4500756 -0.4815817 0.4136295 0.4642316 -0.8453873 0.3766703 1.0120847 -0.0121667 -0.1763505 -0.3130531 0.4056029 0.0326702 0.1983111 0.5162048 0.3875825 0.1910794 1.2821739 0.2371383 -0.0238118 0.7407965 0.7270489 0.5630321 0.7027966 0.7290032 0.9905021 -0.4572447 -0.0668186 0.0703586 0.0095592 0.0321092 -0.0295632 0.1850675 -0.0035919 -0.0174484 0.4707047 0.036262 0.0040604 0.1204674 0.3132884 -0.0525064 0.1262282 -0.0250481 0.2457132 0.2062474 -0.0345065 -0.010278 -0.0041033 0.2781454 -0.0688805 0.034053 -0.0582451 0.2322007 0.0137711 -0.0742263 -0.0561762 -0.0898535 0.0713398 -0.1098228 -0.0783952 -0.1156372 0.0277802 0.0614959 -0.02879 -0.018213 -0.0668051 0.0717516 -0.0716955 -0.0757927 -0.0844381 0.0362199 0.0444344 -0.0055608 -0.0192248 -0.0332398 0.090921 0.0665849 0.0346983 0.0859502 -0.0621396 0.0217434 0.018154 0.0047755 0.0826599 -0.0740306 -0.0021292 0.0024727 -0.0100591 0.1252009 0.2558747 -0.0125987 0.0265556 0.0211588 0.3151556 -0.1201719 0.0760419 -0.1091502 0.2147893 0.2994423 -0.0356012 -0.0238143 -0.0455255 0.3091975 -0.0910629 -0.0377755 -0.0942328 0.2611105 unknown
polarizability: 174.7010303|25.1135371|72.1795821|-5.6476237|28.6513179|89.4738306 unknown
InChI: InChI=1S/C6H8N4O2/c1-3(11)9-6-8-2-4(7)5(12)10-6/h2,9-10H,7H2,1H3
charge 0 multiplicity 1
20 atoms
O  -2.310922 0.763739 1.801431
O  2.101254 1.515771 1.455975
N  -0.258552 0.457636 0.692384
N  1.854038 0.157449 -0.424193
N  -0.065038 -0.879577 -1.285802
N  -3.602323 -0.812933 -0.044609
C  0.465684 -0.104062 -0.347875
C  -2.244657 -0.612491 -0.193986
C  -1.644154 0.251251 0.846126
C  -1.428981 -1.133944 -1.205184
C  2.616442 0.935249 0.445502
C  4.093452 1.029644 0.098758
H  0.263937 1.04829 1.369223
H  2.296161 -0.300664 -1.225852
H  -1.83606 -1.774723 -1.993526
H  4.59185 1.654277 0.853377
H  4.242258 1.486549 -0.896814
H  4.568648 0.031546 0.091238
H  -4.141715 -1.385479 -0.686053
H  -4.05142 -0.356326 0.750682
