program: Gaussian 09
title: 000252085
version: EM64L-G09RevD.01
frameworkgroup: C1[X(C11H12N8O2)]
method: RPBEPBE
basis: SDD
operation: Freq
keyword: #p
keyword: freq=noraman
keyword: PBEPBE/SDD
title: #p freq=noraman PBEPBE/SDD
converged: NO YES NO NO
title: Mulliken charges:
elementType: O O N N N N N N N N C C C C C C C C C C C H H H H H H H H H H H H
charge: -0.237827 -0.237835 -0.425665 -0.425663 -0.062639 -0.062664 -0.035069 -0.035084 -0.622601 -0.622606 -0.494673 0.275874 0.275883 -0.172706 -0.172725 -0.390745 -0.390794 0.152313 0.152323 0.023941 0.023975 0.241775 0.277372 0.322481 0.322477 0.234356 0.234373 0.254206 0.254234 0.358556 0.313300 0.358557 0.313300
chargesum: 0.00000
title: Mulliken charges with hydrogens summed into heavy atoms:
elementType: O O N N N N N N N N C C C C C C C C C C C
charge: -0.237827 -0.237835 -0.103184 -0.103186 -0.062639 -0.062664 -0.035069 -0.035084 0.049254 0.049251 0.024475 0.275874 0.275883 0.061650 0.061648 -0.136539 -0.136560 0.152313 0.152323 0.023941 0.023975
polarizability: 3.02834207e+02 2.68801180e-02 2.14617132e+02 -1.57700209e-02 1.52117397e+01 1.09792701e+02
1716.lowfreq: -2.8999 -1.9934 -0.0004 0.0005 0.0006 3.0348 13.3178 13.5579 24.6247
frequency: 13.2649 13.5397 24.6062 72.6879 78.2402 89.4704 114.1344 118.1244 126.9901 171.8042 196.0409 196.8511 211.9579 227.1307 253.6428 254.7913 264.4275 320.3607 339.5427 352.5546 365.9561 400.8536 434.2094 519.9903 522.1728 525.7049 525.8996 529.9844 552.2598 563.6127 563.9790 576.6497 578.8928 624.6619 642.4264 658.6121 672.6155 692.6102 704.5880 728.6029 728.8734 811.7719 846.7712 847.9317 868.3609 873.4264 924.9090 958.0839 960.7681 990.0140 1009.0620 1020.2526 1053.6800 1096.2018 1097.5200 1117.1335 1140.4084 1143.6936 1181.6127 1224.2985 1225.2442 1270.5698 1295.5846 1296.4369 1353.1126 1354.2755 1405.5085 1408.8398 1423.5043 1429.7198 1431.7245 1554.1484 1554.3517 1589.3554 1590.7473 1604.4783 1606.6997 1628.7193 1640.4092 1642.2780 1652.9975 2938.1193 2969.5904 2977.6143 3100.4741 3184.5572 3184.5797 3537.5042 3537.6577 3554.5236 3554.6714 3706.5364 3706.5709
redmass: 5.9213 6.3659 9.4314 7.6661 6.6108 4.5143 3.5202 3.9132 5.0879 2.9909 5.2302 5.1111 4.3987 4.1461 1.1483 1.1544 9.2194 3.5830 3.2306 7.0321 4.8863 6.2105 4.0998 3.9954 6.4595 1.2855 1.5135 2.6804 5.3953 3.7880 3.2317 1.4463 1.2147 4.8329 6.4428 4.4731 4.3978 6.1991 6.4575 4.3516 4.4061 1.7551 1.6755 1.7576 4.6246 4.0768 1.4459 2.6672 2.3864 4.7467 2.7580 2.5013 2.9018 2.3389 2.1075 4.3161 2.5366 2.2590 1.2717 2.8195 2.8275 1.3617 1.5515 1.5551 1.5855 1.3955 3.0836 3.3883 1.1117 6.0430 5.7911 5.2800 5.3182 1.7699 1.6313 5.5169 6.6222 4.6119 2.7262 3.1996 7.6686 1.0680 1.0874 1.0879 1.0906 1.0929 1.0928 1.0770 1.0770 1.0462 1.0463 1.1053 1.1053
irintensity: 2.0335 2.0876 7.3581 0.4239 9.8177 4.1678 5.8160 2.8451 3.6443 11.6233 5.8696 0.2109 11.0945 1.3848 25.9485 104.4828 6.4811 0.0505 2.3084 17.6140 16.1541 0.0040 6.3717 9.2721 11.6949 110.8923 380.9565 113.4611 2.2352 1.4190 1.5902 18.0637 91.9787 14.8521 4.5542 4.8271 16.8192 13.5818 0.0005 11.7770 0.3943 19.8355 52.6067 62.9506 25.0858 6.3620 26.3045 2.9032 4.3999 96.3847 1.8381 10.0185 5.5898 15.9885 35.9388 9.2100 0.9056 19.8707 4.3027 111.9084 57.7672 0.2624 32.9993 69.2344 8.6793 9.5020 8.1298 30.6504 35.0074 469.8186 66.9865 4.3188 772.1291 103.7709 4.5231 300.2642 423.6189 252.9521 927.4320 63.2798 2.0500 2.3375 1.2223 60.1593 3.6063 3.8973 1.4634 46.4304 41.9041 64.8399 146.5238 65.7030 25.2863
temp: 298.150 k
press: 1.00000 atm
elementType: 8 8 7 7 7 7 7 7 7 7 6 6 6 6 6 6 6 6 6 6 6 1 1 1 1 1 1 1 1 1 1 1 1
symmnumber: 1
zpe: 631809.6 jmol-1
zpe.correction: 0.240644 hartree
zpe.thermalcorrener: 0.260673 hartree
zpe.thermalcorrenthalpy: 0.261617 hartree
zpe.thermalcorrgfe: 0.188785 hartree
zpe.sumelectzpe: -1013.302265 hartree
zpe.sumelectthermal: -1013.282236 hartree
zpe.sumelectthermalent: -1013.281292 hartree
zpe.sumelectthermalfe: -1013.354124 hartree
dipole: 0.0043 11.6611 4.7483
dipole: 12.5908
quadrupole: -206.4566 -100.3816 -129.9365
quadrupole: -0.0058 0.0521 -12.7374
quadrupole: -60.8650 45.2100 15.6551 -0.0058 0.0521 -12.7374
hfenergy: -1013.5429085 hartree
pointgroup: C01 [X(C11H12N8O2)]
dipole: 0.0017521 4.9249253 -0.5321856 debye
polarizability: 302.8341862|0.0049779|203.7276782|-0.0686668|-35.4160648|120.6821755 unknown
InChI: InChI=1S/C11H12N8O2/c12-10-16-6(4-8(20)18-10)14-2-1-3-15-7-5-9(21)19-11(13)17-7/h2-5,16-17H,1,12-13H2
charge 0 multiplicity 1
33 atoms
O  6.038196 -2.188862 0.152654
O  -6.039958 -2.187037 0.15844
N  4.081388 1.377702 -0.262939
N  -4.080782 1.377625 -0.262592
N  2.230949 0.786924 1.046299
N  -2.230225 0.787165 1.046652
N  6.005599 0.00113 -0.704725
N  -6.006015 0.001723 -0.702057
N  5.900174 2.177822 -1.55182
N  -5.90003 2.177736 -1.550818
C  0.000421 0.385356 1.97648
C  3.459415 0.362864 0.481254
C  -3.459028 0.363168 0.482298
C  1.259044 -0.05397 1.261346
C  -1.258518 -0.053917 1.261882
C  4.111341 -0.840368 0.652497
C  -4.111502 -0.839571 0.654937
C  5.342091 1.143313 -0.82854
C  -5.342002 1.143475 -0.827142
C  5.439065 -1.078361 0.036315
C  -5.439319 -1.077676 0.038998
H  0.000639 -0.090208 2.984218
H  0.000483 1.476562 2.123633
H  3.602811 2.279567 -0.311687
H  -3.601813 2.27923 -0.312296
H  1.311489 -1.11594 0.941738
H  -1.311413 -1.11605 0.942888
H  3.687466 -1.635118 1.271245
H  -3.687922 -1.63384 1.274504
H  6.81761 1.99955 -1.953661
H  5.443311 3.072331 -1.704897
H  -6.817858 1.999663 -1.95185
H  -5.44271 3.071811 -1.705055
