program: Gaussian 09
title: 000252074
version: EM64L-G09RevD.01
frameworkgroup: C1[X(C15H12O3)]
method: RPBEPBE
basis: SDD
operation: Freq
keyword: #pfreq=noraman
keyword: PBEPBE/SDD
title: #p freq=noraman PBEPBE/SDD
converged: YES YES NO NO
title: Mulliken charges:
elementType: O O O C C C C C C C C C C C C C C C H H H H H H H H H H H H
charge: -0.398864 -0.435847 -0.360775 0.149480 0.516382 0.196313 0.147711 -0.269640 -0.328860 -0.493759 -0.299090 -0.420519 0.292039 -0.355240 -0.279986 -0.200015 -0.191151 -0.398142 0.275571 0.218847 0.250348 0.218142 0.242365 0.257035 0.230983 0.232566 0.232524 0.226837 0.385732 0.359015
chargesum: 0.00000
title: Mulliken charges with hydrogens summed into heavy atoms:
elementType: O O O C C C C C C C C C C C C C C C
charge: -0.013132 -0.076831 -0.360775 0.149480 0.516382 0.196313 0.147711 0.005930 -0.110013 -0.243412 -0.080948 -0.178154 0.292039 -0.098205 -0.049003 0.032551 0.041373 -0.171305
polarizability: 3.83461447e+02 1.62152052e+01 1.93350007e+02 2.09839653e-01 2.30436508e-03 6.65282524e+01
1716.lowfreq: -0.0006 0.0006 0.0006 4.4604 6.9564 8.6646 25.3748 39.2914 53.1432
frequency: 24.6509 39.2838 53.1382 96.1471 140.4200 159.5898 162.6449 207.0010 224.1594 253.7273 280.7381 330.4760 349.9665 403.0565 427.4683 428.1410 448.7937 458.8741 514.3434 515.6267 522.2493 550.6531 575.9331 579.1640 658.1530 664.1136 695.2065 729.0983 750.2413 765.9373 788.6420 802.9496 855.7288 861.1075 871.5039 883.2160 894.7910 944.7754 962.2165 969.8736 983.5473 986.2589 998.0857 1012.3158 1022.3614 1029.5119 1089.4480 1125.8026 1141.6962 1172.1721 1178.1748 1189.9202 1218.8082 1240.7704 1257.1168 1282.2317 1302.0758 1304.8127 1326.9373 1367.1213 1396.1218 1403.6784 1427.8876 1466.4203 1472.7077 1482.8418 1532.3147 1581.5736 1583.9785 1623.6789 1630.8528 1635.7754 2582.8465 3106.7716 3120.0307 3135.4466 3139.0546 3145.9410 3160.5920 3162.7360 3167.0687 3169.4868 3177.8600 3585.6745
redmass: 5.4691 5.2861 5.8600 4.7693 3.3516 4.8237 6.5879 6.3736 4.4325 4.3672 3.3541 5.9424 1.1170 5.0939 3.3880 6.8194 2.8547 5.3126 6.0712 3.1659 5.4494 6.6855 6.6400 3.8990 6.5667 3.1499 2.2730 6.9469 1.9381 1.6202 1.6820 6.0600 5.8981 1.5669 1.6478 1.5756 1.6729 1.3784 2.7904 1.3265 6.1518 1.3357 1.0687 1.2317 4.9285 2.0815 1.7008 1.6693 1.4205 1.1519 1.1178 1.5649 1.4999 1.5574 3.1410 2.5635 1.5454 2.1193 1.4173 2.9325 6.6071 8.3532 2.1835 2.7770 2.5755 2.7999 3.7155 4.9801 3.5381 5.9521 5.4248 4.8977 1.0735 1.0896 1.0890 1.0857 1.0900 1.0902 1.0926 1.0969 1.0941 1.0915 1.0989 1.0661
irintensity: 2.0109 0.3586 0.5155 0.5229 0.0146 0.1107 0.3072 0.2766 1.5460 0.0645 4.2311 4.6657 146.1278 20.8246 0.6530 0.5615 5.9734 4.4694 5.0685 6.4498 5.7991 0.9547 53.8116 3.4127 30.1488 16.8211 9.7654 17.0459 18.6949 118.9660 21.6661 1.2684 8.9813 6.5917 5.7812 21.4395 0.2724 0.6037 55.8963 0.7480 4.3670 2.2512 128.2412 48.5603 32.2548 18.1048 14.7803 6.8018 151.1296 60.2689 1.2615 56.2660 53.7399 85.4411 289.3018 29.6862 101.4096 46.4503 88.8250 113.4669 16.3600 81.1864 82.3433 31.8184 263.9734 46.3647 81.4305 60.8039 152.1072 17.0118 65.4736 445.5561 359.1248 0.4494 9.7699 2.1652 9.2566 10.0363 15.4701 13.1169 7.6006 24.9094 17.6771 50.5668
temp: 298.150 k
press: 1.00000 atm
elementType: 8 8 8 6 6 6 6 6 6 6 6 6 6 6 6 6 6 6 1 1 1 1 1 1 1 1 1 1 1 1
symmnumber: 1
zpe: 597919.4 jmol-1
zpe.correction: 0.227735 hartree
zpe.thermalcorrener: 0.242842 hartree
zpe.thermalcorrenthalpy: 0.243786 hartree
zpe.thermalcorrgfe: 0.184068 hartree
zpe.sumelectzpe: -803.211730 hartree
zpe.sumelectthermal: -803.196624 hartree
zpe.sumelectthermalent: -803.195680 hartree
zpe.sumelectthermalfe: -803.255397 hartree
dipole: -5.0427 2.9119 -0.0212
dipole: 5.8231
quadrupole: -73.8457 -102.1024 -111.3195
quadrupole: 10.8909 -0.0840 0.0587
quadrupole: 21.9102 -6.3466 -15.5636 10.8909 -0.0840 0.0587
hfenergy: -803.4394654 hartree
pointgroup: C01 [X(C15H12O3)]
dipole: -1.8976039 1.2050339 0.4422485 debye
polarizability: 383.8785012|7.4896812|182.7303104|-15.5481557|32.7298584|76.7308944 unknown
InChI: InChI=1S/C15H12O3/c16-12-5-3-4-11(10-12)8-9-15(18)13-6-1-2-7-14(13)17/h1-10,16-17H
charge 0 multiplicity 1
30 atoms
O  3.834511 -2.078429 -0.83411
O  -4.430382 2.565124 0.959916
O  1.351069 -2.090051 -0.707264
C  2.553356 -0.073495 -0.207758
C  -2.546827 -0.469104 -0.035264
C  1.296888 -0.83312 -0.351231
C  3.803284 -0.758734 -0.465269
C  -1.170841 -0.932349 -0.245362
C  2.607673 1.303186 0.171048
C  -2.8619 0.856605 0.37137
C  -0.01438 -0.209211 -0.101536
C  -3.610817 -1.395716 -0.24905
C  -4.204064 1.238517 0.55754
C  5.036998 -0.065943 -0.338444
C  3.829375 1.978754 0.292965
C  -4.95028 -1.002563 -0.060327
C  5.04702 1.285457 0.035844
C  -5.26007 0.314665 0.343766
H  -1.0467 -1.980679 -0.553516
H  1.680948 1.849347 0.37162
H  -2.083179 1.604054 0.548283
H  -0.04208 0.840879 0.201833
H  -3.375566 -2.418874 -0.562297
H  5.95944 -0.617594 -0.540943
H  3.848724 3.033547 0.584147
H  -5.760594 -1.719835 -0.226879
H  6.003172 1.812257 0.13076
H  -6.304501 0.618845 0.490553
H  2.834659 -2.395201 -0.870375
H  -5.39674 2.745467 1.069979
