program: Gaussian 09
title: 000252089
version: EM64L-G09RevD.01
frameworkgroup: C1[X(C10H15BrN2O4)]
method: RPBEPBE
basis: SDD
operation: Freq
keyword: #p
keyword: freq=noraman
keyword: PBEPBE/SDD
title: #p freq=noraman PBEPBE/SDD
converged: YES YES NO NO
title: Mulliken charges:
elementType: Br O O O O N N C C C C C C C C C C H H H H H H H H H H H H H H H
charge: 0.064387 -0.264884 -0.288954 -0.261683 -0.220696 -0.154670 -0.409421 -0.437117 0.086609 0.218682 0.009319 -0.237116 -0.249686 -0.327274 0.223529 -0.669390 -0.673558 0.267474 0.261304 0.193583 0.301421 0.211844 0.194929 0.224872 0.223016 0.366658 0.210344 0.226572 0.233278 0.224395 0.214194 0.238040
chargesum: 0.00000
title: Mulliken charges with hydrogens summed into heavy atoms:
elementType: Br O O O O N N C C C C C C C C C C
charge: 0.064387 -0.264884 -0.288954 -0.261683 -0.220696 -0.154670 -0.042763 0.091660 0.280192 0.218682 0.310740 0.169657 0.198201 -0.327274 0.223529 0.000804 0.003071
polarizability: 2.11980180e+02 2.07064223e+01 1.51186997e+02 -1.23775479e+01 1.06716030e+01 1.01618687e+02
1716.lowfreq: -5.9719 -1.8790 0.0006 0.0010 0.0010 5.1776 15.5711 29.5604 33.3987
frequency: 14.8974 29.4644 33.3268 37.8761 51.9681 68.5046 74.5197 109.5518 143.3019 168.6172 188.6722 199.1062 212.3288 229.6005 239.2694 265.3963 282.2088 307.0101 343.6130 378.0632 394.5219 412.3142 432.3065 496.9224 518.5701 561.5835 591.7302 626.0088 691.0146 711.7076 741.1574 773.8437 778.3537 802.9223 809.3159 812.0198 864.8278 896.4777 910.5004 965.9325 990.6968 1021.5781 1031.6620 1050.0285 1083.1783 1088.9873 1109.5745 1124.4613 1136.1435 1161.5609 1174.2858 1234.9912 1255.1639 1269.1776 1286.6898 1310.3990 1329.7723 1340.8180 1352.7859 1362.8310 1366.2504 1380.4497 1390.7914 1398.5571 1405.7967 1442.6569 1460.0959 1466.7514 1474.0056 1478.6094 1484.4091 1493.2770 1599.9132 1638.6872 1655.3907 2916.0530 2941.0767 2986.5205 2995.9845 2996.6420 3013.8308 3047.0405 3071.6164 3085.1013 3094.7090 3103.0182 3103.9837 3120.8618 3194.6315 3523.4986
redmass: 5.0314 5.4986 3.7124 2.6899 2.2146 3.5770 4.9917 3.9322 4.6424 7.6180 2.8468 3.2285 2.7026 2.6429 1.3494 4.0593 3.7580 6.5821 3.5989 6.2884 3.4046 3.2395 4.3212 5.1612 2.8686 5.1354 5.9749 5.5211 1.9859 10.2846 7.5083 2.2679 2.1052 2.3076 1.6730 1.1565 2.8669 1.4385 2.4792 6.0687 3.8211 3.1956 3.6364 2.9342 2.3805 2.9539 2.6785 2.3875 1.4654 1.8644 7.4130 1.3835 1.1440 1.1566 3.3087 1.2773 1.3915 1.3862 1.3673 1.6016 1.5264 1.3494 1.2219 1.3173 2.2512 1.1002 1.0405 1.0463 1.0584 1.0497 1.0705 1.0794 5.8584 11.7304 5.9005 1.0828 1.0575 1.0360 1.1051 1.0366 1.0620 1.0597 1.1003 1.0985 1.0992 1.1041 1.1013 1.1048 1.0945 1.0769
irintensity: 0.5542 1.4778 2.4254 0.4284 0.3214 0.7858 0.4361 4.9800 0.8086 3.1804 1.5515 0.8626 3.8296 0.6796 0.4459 0.5812 13.5585 1.3151 0.4041 9.5375 18.0313 17.3236 0.0922 22.9431 15.9383 7.4854 24.0940 23.2563 5.8109 2.0925 4.0226 133.8468 5.1622 2.4911 3.5822 2.6184 1.7913 22.9000 14.8722 252.9804 59.7868 17.9371 116.3478 39.3330 79.8964 23.5244 29.3085 20.7138 7.4763 34.5817 3.6046 25.0412 3.3510 11.7552 120.4185 21.0020 6.7266 27.8893 5.8004 16.1061 22.4458 5.5436 29.6370 34.9539 66.3364 30.9477 11.0629 11.8120 1.3217 10.5627 12.5796 10.3006 24.1171 304.8244 728.6480 28.4485 59.6590 17.8507 38.9207 23.9942 38.3671 16.9166 12.2921 31.9215 29.4145 42.2871 35.2353 1.3216 6.6453 64.1653
temp: 298.150 k
press: 1.00000 atm
elementType: 35 8 8 8 8 7 7 6 6 6 6 6 6 6 6 6 6 1 1 1 1 1 1 1 1 1 1 1 1 1 1 1
symmnumber: 1
zpe: 653246.7 jmol-1
zpe.correction: 0.248809 hartree
zpe.thermalcorrener: 0.267510 hartree
zpe.thermalcorrenthalpy: 0.268454 hartree
zpe.thermalcorrgfe: 0.197713 hartree
zpe.sumelectzpe: -812.608521 hartree
zpe.sumelectthermal: -812.589820 hartree
zpe.sumelectthermalent: -812.588876 hartree
zpe.sumelectthermalfe: -812.659616 hartree
dipole: 5.5676 -2.0236 0.2431
dipole: 5.9289
quadrupole: -118.3061 -110.9342 -108.9822
quadrupole: 2.4457 9.3350 -4.6451
quadrupole: -5.5653 1.8067 3.7586 2.4457 9.3350 -4.6451
hfenergy: -812.8573299 hartree
pointgroup: C01 [X(C10H15Br1N2O4)]
dipole: -2.1076136 0.7294699 -0.683328 debye
polarizability: 165.4219522|-32.1162383|183.9194022|4.0073629|-38.0652126|115.4445103 unknown
InChI: InChI=1S/C10H15BrN2O4/c1-3-16-8(17-4-2)6-13-5-7(11)9(14)12-10(13)15/h5,8,12H,3-4,6H2,1-2H3
charge 0 multiplicity 1
32 atoms
Br 1.791451 -3.711566 2.438556
O  -2.755599 1.362459 -0.029768
O  -2.176678 -0.835281 0.613741
O  1.727559 1.538225 -0.61205
O  4.059469 -2.33376 0.594442
N  0.663363 0.014677 0.83989
N  2.843987 -0.416788 0.041963
C  -0.542382 0.871953 0.904963
C  -1.682109 0.368577 -0.001349
C  1.74901 0.457879 0.039888
C  0.697524 -1.204056 1.514023
C  -2.682305 2.289572 -1.184527
C  -3.246169 -1.537646 -0.141745
C  1.793145 -2.033588 1.478233
C  2.993127 -1.675376 0.709846
C  -3.896945 3.211296 -1.100881
C  -2.708974 -2.30442 -1.358924
H  -0.241711 1.881387 0.583966
H  -0.916666 0.909383 1.941646
H  -1.317823 0.18441 -1.039658
H  -0.214997 -1.460641 2.055497
H  -1.738188 2.871962 -1.145242
H  -2.68531 1.701713 -2.128126
H  -3.674652 -2.230632 0.600685
H  -4.018561 -0.79859 -0.425134
H  3.648339 -0.116474 -0.518649
H  -3.894504 3.923482 -1.945823
H  -4.83261 2.62722 -1.136539
H  -3.883589 3.785386 -0.158823
H  -3.526358 -2.88931 -1.820291
H  -2.306845 -1.628953 -2.135511
H  -1.910897 -3.005704 -1.0589
