program: Gaussian 09
title: 000252037
version: EM64L-G09RevD.01
frameworkgroup: C1[X(C11H7ClO3)]
method: RPBEPBE
basis: SDD
operation: Freq
keyword: #p
keyword: freq=noraman
keyword: PBEPBE/SDD
title: #p freq=noraman PBEPBE/SDD
converged: NO YES NO NO
title: Mulliken charges:
elementType: Cl O O O C C C C C C C C C C C H H H H H H H
charge: -0.033322 -0.247905 -0.186934 -0.229509 0.390880 0.164938 -0.320188 0.070929 -0.335785 -0.322974 0.088087 -0.142308 0.155203 -0.178851 -0.747256 0.301985 0.274778 0.276391 0.267956 0.253612 0.246218 0.254054
chargesum: 0.00000
title: Mulliken charges with hydrogens summed into heavy atoms:
elementType: Cl O O O C C C C C C C C C C C
charge: -0.033322 -0.247905 -0.186934 -0.229509 0.390880 0.164938 -0.018203 0.070929 -0.061007 -0.046583 0.088087 -0.142308 0.155203 0.089105 0.006629
polarizability: 2.55678447e+02 -1.26455862e+00 1.38673536e+02 -1.28918877e-02 3.68257585e-02 5.58845000e+01
1716.lowfreq: -5.9941 -3.8668 -0.0023 -0.0022 -0.0021 5.8662 35.5658 58.6676 79.5094
frequency: 35.5628 58.6654 79.5042 131.7166 154.4972 172.2573 228.3634 240.2459 287.4813 320.5059 336.1503 367.6363 374.5108 381.5661 456.1515 501.4110 541.1807 553.6810 555.1086 583.8907 643.2710 652.7999 723.3283 726.0988 744.6641 826.0597 827.8768 841.4522 879.4774 903.0621 958.3945 977.1551 983.0154 1031.8256 1059.1980 1078.0378 1126.1151 1207.1667 1210.6900 1258.8787 1272.2725 1340.4613 1380.3753 1399.7638 1406.4746 1427.6236 1442.9140 1464.3237 1537.2922 1568.5190 1600.5785 1621.1101 1685.6076 2997.1488 3078.1856 3130.1475 3131.1478 3164.2276 3168.1953 3187.2262
redmass: 3.8558 8.2290 7.1563 9.3101 7.0366 1.0772 7.0175 5.9442 7.7372 8.5491 6.8509 6.4382 5.2480 3.8972 3.1516 9.0104 5.8570 3.4056 6.9048 3.3607 6.5931 6.2329 5.0174 7.3662 4.6799 6.0879 1.4596 8.4380 1.4105 6.3456 1.3427 2.0527 1.4248 1.8209 2.3258 2.3762 1.5084 2.5516 2.2325 1.9226 2.2326 2.5010 1.2559 7.6188 4.9256 1.1173 1.0480 3.2052 6.6677 7.4721 7.5816 7.7564 12.3428 1.0369 1.0947 1.0920 1.1021 1.0935 1.0893 1.0978
irintensity: 6.0960 1.1540 2.5097 1.0623 0.7393 0.5182 8.9311 4.5061 3.1295 4.6339 0.5267 0.9111 0.2429 0.0762 7.4106 2.3266 43.9869 7.2390 11.5792 0.8238 9.2684 9.9570 1.9085 22.2474 10.2794 65.5267 53.8215 31.9939 6.7154 10.4946 0.0412 30.0530 26.2279 0.7534 42.7406 5.6241 15.0592 13.7278 320.7546 0.1079 46.9887 9.7620 71.0623 15.3860 13.5421 57.1242 20.4763 48.4515 258.1774 42.2696 27.0809 57.8329 554.7610 0.5745 4.5812 2.6519 22.4213 0.2693 0.0422 0.5509
temp: 298.150 k
press: 1.00000 atm
elementType: 17 8 8 8 6 6 6 6 6 6 6 6 6 6 6 1 1 1 1 1 1 1
symmnumber: 1
zpe: 394900.7 jmol-1
zpe.correction: 0.150410 hartree
zpe.thermalcorrener: 0.163320 hartree
zpe.thermalcorrenthalpy: 0.164264 hartree
zpe.thermalcorrgfe: 0.109894 hartree
zpe.sumelectzpe: -1108.058469 hartree
zpe.sumelectthermal: -1108.045558 hartree
zpe.sumelectthermalent: -1108.044614 hartree
zpe.sumelectthermalfe: -1108.098984 hartree
dipole: 2.5739 0.4921 0.0087
dipole: 2.6206
quadrupole: -96.5164 -100.8689 -93.0735
quadrupole: 5.0943 -0.0486 -0.0317
quadrupole: 0.3032 -4.0493 3.7461 5.0943 -0.0486 -0.0317
hfenergy: -1108.2088783 hartree
pointgroup: C01 [X(C11H7Cl1O3)]
dipole: 0.9923135 -0.2665589 -0.0850897 debye
dipolederiv: -0.7431472 -0.1262409 0.2340988 -0.2432301 -0.1357635 0.1052099 0.3009495 0.0778725 -0.1654968 -1.2872928 -0.1732709 0.3508438 0.2300472 -0.311969 0.0094742 0.123103 0.1032349 -0.2875056 -1.1601977 -0.2037402 0.3144222 -0.4599172 -0.5325266 0.2366005 0.4581312 0.1765758 -0.5097459 -0.6773498 0.0862364 0.0361139 0.4217487 -0.8419004 0.2002717 -0.1526943 0.27884 -0.4295175 -0.5587689 0.2004646 0.0155474 0.3656296 -0.210772 0.0298916 -0.0773078 0.068289 -0.0268718 0.6240181 0.2489151 -0.2545628 -0.0235468 0.1906324 -0.0260422 -0.100456 -0.0894931 0.2083971 0.9702382 -0.2067051 -0.1106723 -0.1072928 0.1297627 -0.0509358 -0.1658803 -0.0282293 0.0497505 -1.302731 0.3158055 0.1106274 -0.2410846 -0.32566 0.2056045 0.4231561 0.07625 -0.2017785 0.0647768 -0.2035111 0.081507 -0.0060626 0.0106202 -0.0498094 -0.0297906 -0.0035725 -0.0718029 -0.2009007 -0.1053799 0.0699467 -0.048377 0.0556636 -0.107761 0.0376459 -0.0944826 -0.1106216 1.767795 0.2530199 -0.488932 0.3898614 0.7130738 -0.3355267 -0.5660793 -0.302984 0.5823436 0.9518632 0.3253992 -0.4268267 0.6624391 -0.0428847 -0.1754435 -0.6185354 -0.0967089 0.1218147 1.7085998 -0.387729 -0.1432107 -0.6646483 0.8973342 -0.2704577 0.0133646 -0.3357385 0.322467 -0.2504991 -0.0230114 0.0542067 -0.2237314 0.075971 -0.033469 0.1682423 -0.0804577 -0.0702193 -0.4500518 -0.1040183 0.1640647 -0.2028602 -0.0462907 0.0790697 0.2194035 0.0565883 -0.0698393 0.1450322 -0.0206993 0.0087468 -0.0248132 0.0651456 0.0440329 0.0109356 0.0431655 0.1057273 0.1001082 0.0248171 0.0006915 -0.006474 0.0373439 0.0723262 0.0185947 0.0651569 0.1216755 0.0861941 -0.0156499 0.0301676 0.0110566 0.0414729 0.0742465 0.0148876 0.0804625 0.1284896 0.0128401 0.0643619 -0.0014402 0.0478681 0.0907542 0.0291916 0.0081305 0.0253025 0.1460182 0.1265344 -0.0088711 0.0135955 -0.0262955 -0.0026251 -0.0834881 0.0046223 -0.0767765 0.0863287 -0.0356569 0.0722345 -0.0043799 0.1607512 0.002994 0.0296051 -0.0541224 0.0499758 0.1062577 0.1085958 -0.0124272 -0.0545557 -0.0110682 0.1396235 0.017409 -0.036301 0.0067295 -0.0358708 unknown
polarizability: 247.7496804|-17.7541788|120.3258419|-34.7396115|-32.2130222|82.1609605 unknown
InChI: InChI=1S/C11H7ClO3/c1-6(13)9-5-7-4-8(12)2-3-10(7)15-11(9)14/h2-5H,1H3
charge 0 multiplicity 1
22 atoms
Cl 4.958802 0.814776 -1.337448
O  -0.203997 -1.171092 0.994409
O  -2.452654 -1.01511 1.428602
O  -2.548912 2.768312 -0.678474
C  0.997163 0.558816 -0.261306
C  0.975471 -0.683157 0.444271
C  -0.238948 1.282185 -0.381284
C  -1.433172 0.820665 0.156871
C  2.23076 1.019468 -0.81004
C  2.145175 -1.456528 0.607803
C  -1.483589 -0.455473 0.888361
C  3.379984 0.242231 -0.640848
C  -2.668507 1.679862 -0.041311
C  3.3550 -0.990597 0.061586
C  -4.006503 1.237614 0.51169
H  -0.275499 2.240936 -0.914177
H  2.265683 1.968224 -1.353955
H  2.094586 -2.402034 1.153806
H  4.273365 -1.573171 0.175899
H  -4.299479 0.253968 0.102534
H  -4.762535 1.996422 0.259715
H  -3.956394 1.094582 1.606093
