program: Gaussian 09
title: 000252069
version: EM64L-G09RevD.01
frameworkgroup: C1[X(C9H16N4O2)]
method: RPBEPBE
basis: SDD
operation: Freq
keyword: #p
keyword: freq=noraman
keyword: PBEPBE/SDD
title: #p freq=noraman PBEPBE/SDD
converged: YES YES NO NO
title: Mulliken charges:
elementType: O O N N N N C C C C C C C C C H H H H H H H H H H H H H H H H
charge: -0.305096 -0.286229 -0.402886 -0.405251 -0.261016 -0.317766 -0.335493 -0.334273 -0.465296 -0.467281 -0.469829 -0.470323 0.324375 0.302366 -0.361934 0.230614 0.227452 0.244014 0.270708 0.266025 0.242694 0.240670 0.265449 0.263893 0.239686 0.312615 0.306646 0.255470 0.234056 0.297215 0.358726
chargesum: 0.00000
title: Mulliken charges with hydrogens summed into heavy atoms:
elementType: O O N N N N C C C C C C C C C
charge: -0.305096 -0.286229 -0.090272 -0.098606 0.036199 0.040961 -0.104879 -0.106821 0.049426 0.041438 0.036290 0.033256 0.324375 0.302366 0.127592
polarizability: 1.65144849e+02 -1.92270560e+00 1.27626885e+02 -1.98617472e+00 7.86059284e-01 1.05765856e+02
1716.lowfreq: -3.9562 -0.0005 -0.0005 0.0006 1.3189 3.5963 19.2158 40.0162 51.1473
frequency: 19.1083 39.8928 51.1419 57.7309 74.1536 102.9278 114.9530 129.3953 174.3635 224.3494 246.8000 261.6001 277.0794 299.7968 308.2989 335.6102 373.2564 466.9008 530.7762 537.0360 557.4157 645.3610 656.2431 666.5364 715.6934 716.6314 783.9569 785.0972 797.6809 807.2504 809.6756 855.2272 860.2348 886.9527 888.2143 931.7553 936.8455 962.4175 1046.9058 1048.7744 1072.5816 1077.4892 1078.4463 1080.0691 1086.9917 1087.7406 1087.9511 1090.1170 1110.8903 1135.3936 1175.8993 1176.6748 1204.3963 1207.4779 1213.3196 1245.2825 1276.0904 1340.6708 1378.6236 1387.3205 1423.9816 1424.6178 1439.1995 1441.9910 1454.3200 1457.5112 1464.4474 1482.6529 1484.2379 1609.4321 1612.1742 2986.9738 3047.2716 3100.9917 3102.9845 3106.2984 3108.8239 3122.4938 3127.1455 3206.8399 3208.9269 3224.9762 3227.0462 3336.8510 3429.4185 3527.6429 3532.3987
redmass: 4.8372 3.0413 4.3937 3.1960 6.1458 4.0314 4.7961 2.7974 4.3034 3.4949 3.4275 2.8851 4.6058 3.7333 4.3600 4.1170 4.3880 4.2856 1.1343 1.9096 1.8948 2.3126 2.9317 2.0570 4.2542 4.0432 1.0947 1.0891 1.7583 2.0096 1.9362 3.4128 3.5467 2.1055 2.2003 3.5538 4.7014 2.3266 1.2753 1.2477 2.2892 1.1839 1.1478 3.0876 1.4209 1.3101 1.3316 1.5418 3.6412 2.2635 1.3670 1.3647 1.8184 1.8516 1.6158 2.8991 2.1862 1.1942 1.6302 1.6515 1.0873 1.0874 1.4530 1.4084 1.6299 1.5862 1.1498 1.1364 1.1152 6.1136 5.1577 1.0577 1.1077 1.0504 1.0506 1.0619 1.0614 1.0902 1.0908 1.1179 1.1181 1.1161 1.1161 1.0772 1.0742 1.0788 1.0789
irintensity: 1.3361 1.5266 8.2350 0.0872 3.6154 1.0943 6.1638 2.5969 1.7902 4.8696 1.4805 6.8519 22.5552 16.7521 17.1982 0.4990 6.2568 13.2643 96.7506 33.7363 33.1502 104.2130 4.2201 104.5212 2.6176 2.6052 5.9333 5.9939 66.9211 13.2799 12.5920 9.4051 7.6165 4.9223 2.6387 25.8545 46.2110 10.9834 32.9262 21.1117 48.0101 18.0965 24.9482 60.5876 2.5129 0.2553 1.8227 7.8171 57.6406 9.0569 0.4324 0.4978 25.6520 20.6436 3.9587 54.1372 42.6392 2.9625 33.2247 39.5262 11.5737 11.6539 144.1876 88.8527 84.8643 85.0327 1.6717 117.4456 20.5034 49.0987 123.2884 37.6482 40.7133 17.3458 15.4674 13.8072 11.1075 16.0815 14.8477 0.4138 0.5710 13.2819 11.4411 135.3832 3.2543 24.9669 26.8635
temp: 298.150 k
press: 1.00000 atm
elementType: 8 8 7 7 7 7 6 6 6 6 6 6 6 6 6 1 1 1 1 1 1 1 1 1 1 1 1 1 1 1 1
symmnumber: 1
zpe: 671039.9 jmol-1
zpe.correction: 0.255586 hartree
zpe.thermalcorrener: 0.271543 hartree
zpe.thermalcorrenthalpy: 0.272487 hartree
zpe.thermalcorrgfe: 0.209980 hartree
zpe.sumelectzpe: -720.739271 hartree
zpe.sumelectthermal: -720.723313 hartree
zpe.sumelectthermalent: -720.722369 hartree
zpe.sumelectthermalfe: -720.784876 hartree
dipole: 0.5043 1.6947 -0.6952
dipole: 1.8999
quadrupole: -62.9283 -89.2396 -89.2168
quadrupole: -4.3827 -11.6896 0.4684
quadrupole: 17.5332 -8.7780 -8.7552 -4.3827 -11.6896 0.4684
hfenergy: -720.9948566 hartree
pointgroup: C01 [X(C9H16N4O2)]
dipole: -0.0090497 -0.4703902 0.5808492 debye
polarizability: 157.7499345|5.1865751|123.7096664|18.9134552|-7.0271155|117.0779892 unknown
InChI: InChI=1S/C9H16N4O2/c14-8(6-1-2-6)12-10-5-11-13-9(15)7-3-4-7/h6-7,10-13H,1-5H2
charge 0 multiplicity 1
31 atoms
O  2.231615 -0.163042 -0.524545
O  -1.732854 1.230261 -0.71712
N  1.814942 -0.688707 1.712492
N  -1.675365 -1.046583 -1.22177
N  0.791226 -1.644756 1.490657
N  -0.430337 -1.31528 -0.592602
C  3.535332 0.958569 1.200125
C  -3.572599 0.27271 -2.003764
C  3.721853 2.268955 0.398054
C  4.774169 1.174671 0.299547
C  -3.872861 1.564616 -2.799032
C  -4.621533 1.291206 -1.501725
C  2.489486 0.004597 0.710743
C  -2.26593 0.214165 -1.264659
C  -0.461902 -1.143462 0.893328
H  3.688623 1.008434 2.283601
H  -3.947319 -0.668764 -2.420649
H  3.947566 3.17428 0.967962
H  3.05201 2.399241 -0.455816
H  4.797596 0.586673 -0.621851
H  5.736447 1.316113 0.799017
H  -4.401591 1.457842 -3.750122
H  -3.091112 2.328405 -2.771282
H  -4.32808 1.876642 -0.626215
H  -5.673099 0.994751 -1.547289
H  2.032634 -0.506221 2.693745
H  -2.114567 -1.83891 -1.694489
H  -0.59509 -0.090774 1.210591
H  -1.312226 -1.740581 1.270447
H  1.151235 -2.46574 0.982212
H  0.347033 -0.761808 -1.000388
