program: Gaussian 09
title: 000252057
version: EM64L-G09RevD.01
frameworkgroup: C1[X(C19H15NO3)]
method: RPBEPBE
basis: SDD
operation: Freq
keyword: #p
keyword: freq=noraman
keyword: PBEPBE/SDD
title: #p freq=noraman PBEPBE/SDD
converged: YES YES NO NO
title: Mulliken charges:
elementType: O O O N C C C C C C C C C C C C C C C C C C C H H H H H H H H H H H H H H H
charge: -0.286472 -0.256541 -0.218619 -0.474555 0.212212 0.167234 0.325881 0.186862 -0.373509 -0.348623 -0.377770 -0.340179 -0.274091 -0.233563 0.130805 0.245404 -0.343398 -0.359573 -0.222887 -0.236907 0.259647 -0.226636 -0.753362 0.312347 0.193810 0.269732 0.301691 0.310176 0.229937 0.232788 0.274818 0.220113 0.234518 0.231246 0.234501 0.251822 0.251490 0.249652
chargesum: 0.00000
title: Mulliken charges with hydrogens summed into heavy atoms:
elementType: O O O N C C C C C C C C C C C C C C C C C C C
charge: -0.286472 -0.256541 -0.218619 -0.164379 0.212212 0.167234 0.325881 0.186862 -0.061162 -0.154813 -0.108038 -0.038489 -0.044154 -0.000774 0.130805 0.245404 -0.068580 -0.139460 0.011632 -0.005661 0.259647 0.007865 -0.000398
polarizability: 3.91634866e+02 -1.17209603e+00 2.58712918e+02 -4.69775306e+00 9.76169138e+00 9.84830500e+01
1716.lowfreq: -4.8414 -2.9258 0.0003 0.0006 0.0008 3.9035 17.6550 27.8874 30.2701
frequency: 17.5919 27.8808 30.2563 47.7754 55.5961 68.6173 82.3633 110.9649 115.5627 151.9463 168.9965 193.3960 208.7056 234.1720 251.3611 307.5198 332.2433 386.1732 401.9296 408.5857 426.2495 459.1842 468.3734 484.1921 498.0696 515.9290 551.3500 552.5275 588.1127 614.1508 634.0849 640.5377 645.3939 661.9576 687.2077 703.9614 719.6850 745.2889 763.3495 784.2873 787.4165 790.7008 852.1666 854.6151 865.4753 873.3693 880.7345 934.0482 954.9606 982.6414 986.3924 987.9973 989.4160 996.0278 1000.3489 1005.5287 1026.7713 1038.2107 1040.8651 1047.2667 1084.4464 1108.5102 1156.3795 1170.3580 1174.2623 1182.9003 1189.0280 1192.2225 1222.1414 1240.2291 1274.2227 1284.9932 1318.8655 1360.6234 1381.8479 1384.0681 1387.5582 1416.1445 1432.5766 1442.2094 1447.6996 1453.3213 1454.5127 1476.7504 1492.0139 1533.9868 1576.4242 1583.4594 1596.1301 1610.1666 1611.1663 1631.7223 1658.6625 3007.3961 3095.3584 3110.2438 3113.0170 3133.2416 3138.7755 3144.0838 3145.7535 3158.9031 3158.9912 3170.8092 3181.2670 3192.6870 3214.6567 3558.0346
redmass: 5.6346 3.6102 5.0735 3.5651 2.1402 2.3960 3.5757 3.7527 5.4806 4.7222 4.7050 4.9641 5.5816 6.0345 8.0838 7.7002 4.3675 4.8556 2.8232 3.5739 4.2125 4.5735 3.6315 5.2509 5.5584 6.0860 3.2148 6.0884 1.7945 6.3652 3.7036 2.6432 3.0804 6.0419 4.9036 1.5358 6.6822 6.2431 1.4490 5.2850 2.8931 2.4797 2.3870 1.9591 1.7506 4.7545 1.3611 1.4519 1.3778 1.4673 2.3146 1.3922 4.3016 1.3360 3.6513 1.3531 2.5164 1.6322 3.7356 2.2387 1.6102 2.6011 1.7483 2.7206 1.0610 1.4168 1.3346 1.1642 2.0132 2.3958 2.0035 2.4013 1.3519 3.5632 1.4434 4.2691 2.5334 5.9709 2.3164 2.6106 2.3628 1.1109 1.0470 2.2681 2.5113 3.1403 6.2766 6.6056 6.2103 5.7464 5.3677 5.5280 9.6478 1.0368 1.0975 1.0867 1.0878 1.0868 1.0889 1.1009 1.0918 1.0957 1.0956 1.1007 1.0966 1.0916 1.0945 1.0748
irintensity: 1.0176 3.5856 0.3829 0.4832 0.8119 0.6529 4.7102 0.1711 0.6212 2.5567 3.9897 2.5293 0.7963 1.7119 8.3589 7.8445 0.7912 1.1622 0.1408 3.4643 5.5852 4.7810 0.5289 11.2065 3.6700 4.8394 1.9883 3.7481 4.9431 0.5140 26.0047 24.5331 6.1285 13.1323 13.8660 101.2395 5.0785 1.4777 100.5023 12.9784 1.3872 24.0334 12.2697 17.7851 1.1130 12.2392 63.9974 3.4134 1.1248 3.4331 10.1871 6.8527 2.6508 0.5093 149.3480 4.1899 16.3648 9.5037 124.7187 9.0921 25.7375 7.7055 188.1556 511.7474 0.6444 161.6499 15.0801 0.9354 1.4866 89.8194 14.6649 47.4123 1.5764 80.5113 83.7748 7.5585 10.8231 74.9964 4.0004 1.7260 2.7229 30.5663 19.4806 136.5551 431.7663 249.9920 59.6941 2.0638 13.0675 7.7997 52.1127 1.8255 238.3237 1.7818 7.1282 27.7502 10.3012 0.7635 16.8082 11.7733 20.0237 8.4013 29.0074 25.1101 13.9728 4.8472 5.1911 14.3760
temp: 298.150 k
press: 1.00000 atm
elementType: 8 8 8 7 6 6 6 6 6 6 6 6 6 6 6 6 6 6 6 6 6 6 6 1 1 1 1 1 1 1 1 1 1 1 1 1 1 1
symmnumber: 1
zpe: 763775.6 jmol-1
zpe.correction: 0.290907 hartree
zpe.thermalcorrener: 0.310732 hartree
zpe.thermalcorrenthalpy: 0.311677 hartree
zpe.thermalcorrgfe: 0.239413 hartree
zpe.sumelectzpe: -1011.888168 hartree
zpe.sumelectthermal: -1011.868342 hartree
zpe.sumelectthermalent: -1011.867398 hartree
zpe.sumelectthermalfe: -1011.939661 hartree
dipole: 0.6786 5.4748 0.0388
dipole: 5.5168
quadrupole: -94.2610 -134.5256 -137.5609
quadrupole: -1.1648 -0.3716 2.9002
quadrupole: 27.8549 -12.4098 -15.4451 -1.1648 -0.3716 2.9002
hfenergy: -1012.1790743 hartree
pointgroup: C01 [X(C19H15N1O3)]
dipole: -0.1451468 2.1655129 -0.0211457 debye
polarizability: 391.227734|-6.4335166|258.9398473|-7.8158584|-9.9559633|98.6632523 unknown
InChI: InChI=1S/C19H15NO3/c1-13(21)23-18-12-11-17(15-9-5-6-10-16(15)18)20-19(22)14-7-3-2-4-8-14/h2-12,20H,1H3
charge 0 multiplicity 1
38 atoms
O  4.285107 -0.608896 -0.070229
O  -2.185284 -2.247777 0.182617
O  4.634033 -2.939141 -0.187836
N  -1.373149 -0.040797 0.07366
C  0.886667 0.93758 0.10275
C  2.323749 0.759815 0.051716
C  0.032596 -0.236853 0.057391
C  2.857855 -0.575152 -0.028334
C  0.607366 -1.515429 -0.011561
C  0.381413 2.277907 0.197578
C  3.178851 1.909212 0.085443
C  2.019178 -1.690583 -0.05511
C  1.23569 3.382869 0.230953
C  2.649226 3.197708 0.170913
C  -2.392854 -0.998354 0.092995
C  -3.789661 -0.433095 0.021738
C  -4.8401 -1.227505 0.548931
C  -4.100706 0.817709 -0.57661
C  -6.172342 -0.768481 0.508817
C  -5.436392 1.274126 -0.620878
C  5.079318 -1.775522 -0.145566
C  -6.474368 0.486712 -0.071302
C  6.536733 -1.369246 -0.164928
H  -0.045748 -2.388882 -0.027724
H  -0.695978 2.473265 0.26075
H  4.259188 1.75052 0.044309
H  2.434275 -2.696483 -0.110815
H  -1.688828 0.928418 0.103878
H  0.819645 4.393117 0.307163
H  3.31483 4.066912 0.196172
H  -4.585469 -2.202624 0.976547
H  -3.321402 1.422144 -1.05835
H  -6.974664 -1.386997 0.92529
H  -5.66849 2.23381 -1.095378
H  -7.509984 0.842336 -0.106378
H  6.78821 -0.808044 0.751745
H  6.736667 -0.705222 -1.023621
H  7.166026 -2.267873 -0.23474
