program: Gaussian 09
title: 000252078
version: EM64L-G09RevD.01
frameworkgroup: C1[X(C18H17BrO6)]
method: RPBEPBE
basis: SDD
operation: Freq
keyword: #p
keyword: freq=noraman
keyword: PBEPBE/SDD
title: #p freq=noraman PBEPBE/SDD
converged: YES YES NO NO
title: Mulliken charges:
elementType: Br O O O O O O C C C C C C C C C C C C C C C C C C H H H H H H H H H H H H H H H H H
charge: 0.054808 -0.295538 -0.279672 -0.382106 -0.331560 -0.215992 -0.254000 0.034612 -0.614759 0.265785 0.260824 0.377364 0.141961 0.313509 -0.551128 0.503163 -0.704345 -0.332998 -0.345716 -0.378614 -0.353529 0.323938 -0.530245 -0.530476 -0.536418 0.266688 0.254905 0.270203 0.246443 0.282567 0.244692 0.257677 0.383473 0.236407 0.250249 0.229859 0.238259 0.253202 0.243333 0.227550 0.224047 0.251580
chargesum: 0.00000
title: Mulliken charges with hydrogens summed into heavy atoms:
elementType: Br O O O O O O C C C C C C C C C C C C C C C C C C
charge: 0.054808 -0.295538 -0.279672 0.001367 -0.331560 -0.215992 -0.254000 0.034612 -0.093166 0.265785 0.260824 0.377364 0.141961 0.313509 -0.280925 0.503163 -0.704345 -0.086555 -0.063150 -0.133922 -0.095852 0.323938 0.186269 0.204318 0.166759
polarizability: 4.01760165e+02 -1.20136265e+01 2.17910646e+02 2.96873305e+01 9.77062307e+00 1.52392760e+02
1716.lowfreq: -4.0411 -3.3028 0.0006 0.0008 0.0009 0.2525 9.7719 17.8012 30.2801
frequency: 9.5677 17.7083 30.2190 44.8664 63.9622 71.1436 72.5065 88.4990 108.9155 116.7903 135.5642 143.5487 155.0037 168.6273 194.0512 196.7529 198.6594 215.2344 234.4713 237.5428 259.7162 272.8810 277.8135 288.9596 304.1083 345.4841 361.2252 381.1422 413.7827 418.5149 438.6192 459.5509 473.3509 486.8142 534.7854 548.2343 564.0579 573.1520 599.7282 614.2942 621.1091 632.1154 666.7249 690.7402 735.2518 740.2614 757.3012 779.7218 810.7195 825.7683 834.6517 853.7557 882.7105 924.5654 936.1959 953.2143 978.3049 987.0596 998.1675 1006.1988 1040.7289 1050.2752 1061.2947 1088.7328 1104.7387 1111.4977 1112.8251 1114.1948 1148.6725 1154.2729 1160.9857 1171.3723 1180.1693 1183.4766 1222.2986 1240.3911 1257.0066 1293.5889 1303.3190 1307.5509 1361.0618 1374.5466 1376.6975 1402.4974 1415.3434 1427.5663 1429.9932 1437.0808 1444.2788 1454.7804 1457.6544 1467.5396 1468.1181 1468.6712 1470.4910 1475.5375 1499.2427 1541.3190 1559.0807 1567.3818 1593.9800 1619.5889 1626.5872 2385.0761 2967.0158 2974.3360 2996.7187 3005.6009 3058.5011 3070.1928 3077.7447 3111.9314 3118.2147 3131.1937 3132.4243 3141.8303 3151.7258 3166.8929 3173.3167 3193.7611
redmass: 6.4745 6.6785 4.1673 4.2838 4.3700 3.8555 5.4138 5.7947 7.7375 6.0736 4.7491 5.0900 1.7053 3.5201 3.4800 2.5243 3.6615 1.2482 3.0450 2.0796 5.6250 3.9011 4.7186 3.7742 3.2651 9.1173 4.5011 5.9451 2.9766 6.5205 4.8794 5.5433 4.2545 3.2326 6.6061 6.8865 3.0403 6.9648 5.3048 3.8738 5.3254 6.7423 8.1720 4.5722 4.1493 4.6596 3.8524 5.3870 1.4593 2.8282 2.7141 1.5686 8.5582 2.4297 6.9467 1.6706 5.1311 5.5094 1.3878 2.4033 5.1655 1.0696 4.0410 7.1033 1.2450 1.2595 1.2596 1.3233 1.4517 1.3246 1.3973 1.3165 1.5625 1.5200 2.2151 2.9996 3.0019 2.2382 1.3603 3.6965 4.8078 6.3666 5.4660 3.0959 1.4013 1.3111 3.9885 1.1884 1.3884 1.0539 1.8837 1.0512 1.0512 1.0500 1.0743 1.1670 2.4912 8.0012 7.3791 2.9128 8.3768 6.0805 3.3019 1.0827 1.0328 1.0316 1.0285 1.0597 1.1043 1.1047 1.0987 1.1052 1.1053 1.1013 1.0998 1.0880 1.0883 1.0949 1.0971 1.0908
irintensity: 0.1829 0.9439 3.0578 0.7646 3.0677 8.2951 0.2385 0.0483 0.5808 1.2978 9.1628 1.8458 0.5664 2.3387 3.8665 5.9340 1.1039 0.1664 2.2376 4.7268 0.4854 14.7637 0.4853 2.9579 1.3627 7.9315 11.3859 1.9469 0.0739 0.8643 10.4827 5.5588 2.9070 2.4724 4.3290 9.2284 84.1594 10.7982 62.1687 8.9508 5.0163 1.0344 10.3808 12.6229 1.2147 0.7998 6.9495 3.0243 27.7531 17.0970 20.7192 54.1977 25.5482 18.0025 8.4894 14.4709 99.5986 18.0961 1.3759 8.2428 39.3640 118.6849 53.3484 86.0100 6.9209 0.1756 0.9657 17.5640 24.8262 15.9228 14.0619 65.8429 611.1649 3.9588 166.4036 167.2335 49.7081 301.0870 21.1521 159.2504 183.6885 88.6485 29.8470 123.6927 76.6350 25.9636 52.9342 3.0631 9.6268 9.3390 14.9016 13.1505 15.5837 29.6506 35.6925 55.1739 24.2878 275.5889 193.6457 81.8789 121.5549 252.4931 481.0823 484.5416 68.2206 46.1660 66.8258 13.9449 42.0192 28.5834 3.1260 26.9910 21.4786 17.2652 24.6349 10.2668 0.0284 11.3728 6.9008 1.0754
temp: 298.150 k
press: 1.00000 atm
elementType: 35 8 8 8 8 8 8 6 6 6 6 6 6 6 6 6 6 6 6 6 6 6 6 6 6 1 1 1 1 1 1 1 1 1 1 1 1 1 1 1 1 1
symmnumber: 1
zpe: 818468.8 jmol-1
zpe.correction: 0.311738 hartree
zpe.thermalcorrener: 0.336499 hartree
zpe.thermalcorrenthalpy: 0.337444 hartree
zpe.thermalcorrgfe: 0.253911 hartree
zpe.sumelectzpe: -1159.055089 hartree
zpe.sumelectthermal: -1159.030328 hartree
zpe.sumelectthermalent: -1159.029383 hartree
zpe.sumelectthermalfe: -1159.112916 hartree
dipole: -6.0956 5.5013 -3.1951
dipole: 8.8108
quadrupole: -116.1723 -154.9317 -153.2324
quadrupole: 11.9116 23.3771 5.6085
quadrupole: 25.2732 -13.4862 -11.7870 11.9116 23.3771 5.6085
hfenergy: -1159.3668269 hartree
pointgroup: C01 [X(C18H17Br1O6)]
dipole: -2.0105762 1.6086709 -2.3207386 debye
polarizability: 390.726026|-12.4222475|214.2071683|56.5573747|-24.206344|167.1303769 unknown
InChI: InChI=1S/C18H17BrO6/c1-23-11-6-4-10(5-7-11)12(20)8-13(21)16-14(24-2)9-15(25-3)17(19)18(16)22/h4-7,9,22H,8H2,1-3H3
charge 0 multiplicity 1
42 atoms
Br 6.245697 -1.264054 1.067362
O  0.652453 0.336562 -1.025896
O  5.273992 1.518524 -0.578739
O  3.592913 -2.596997 1.486328
O  1.210362 -3.124963 1.306351
O  -0.592365 -0.072189 1.901867
O  -6.33727 1.178115 -0.686387
C  2.055216 -1.139675 0.272801
C  -0.478936 -1.8319 0.203235
C  0.964064 -2.049408 0.614784
C  1.921343 0.059039 -0.513844
C  3.384174 -1.461651 0.768158
C  -1.151847 -0.644593 0.922649
C  -2.505411 -0.222752 0.448467
C  3.017225 0.897444 -0.745655
C  4.305938 0.58145 -0.228395
C  4.497581 -0.61441 0.500427
C  -3.199954 -0.877801 -0.601221
C  -3.134068 0.886652 1.088245
C  -4.478558 -0.449496 -1.012676
C  -4.400706 1.32853 0.688738
C  -5.081331 0.660857 -0.366275
C  0.448853 1.605254 -1.736209
C  6.346836 1.918273 0.359565
C  -7.10196 0.520225 -1.752867
H  -1.02576 -2.759003 0.460968
H  -0.543178 -1.672364 -0.88635
H  2.935822 1.828927 -1.307917
H  -2.752937 -1.739386 -1.108134
H  -2.59663 1.380351 1.904487
H  -4.991028 -0.979167 -1.820892
H  -4.892035 2.178228 1.172034
H  2.645119 -3.074505 1.575218
H  0.691552 2.463714 -1.083186
H  -0.621264 1.6180 -1.988927
H  1.057518 1.645206 -2.659032
H  6.537928 2.976821 0.121793
H  7.253917 1.317682 0.189295
H  6.019568 1.814742 1.408255
H  -7.320828 -0.533592 -1.495388
H  -6.563169 0.566593 -2.718586
H  -8.040238 1.088718 -1.82285
